ACCESSION: MSBNK-GL_Sciences_Inc-GLS00138
RECORD_TITLE: Glutaric acid; EI-B; MS; 2 TMS; RT: 527.64 s
DATE: 2016.01.19 (Created 2012.08.03, modified 2013.07.31)
AUTHORS: Miyagawa H, Akimoto S, Yamasaki K, GL Sciences Inc.
LICENSE: CC BY-SA
COPYRIGHT: GLS
COMMENT: The chemical compound was chemically modified with N-methyl-N-trimethylsilyl-trifluoroacetamide(MSTFA) before GC-MS analysis. When it has two or more functional groups, this modification gave a mixture of the TMS derivatives having different number of TMS groups at different functional groups.

CH$NAME: Glutaric acid
CH$COMPOUND_CLASS: Natural Product
CH$FORMULA: C5H8O4
CH$EXACT_MASS: 132.04226
CH$SMILES: OC(=O)CCCC(O)=O
CH$IUPAC: InChI=1S/C5H8O4/c6-4(7)2-1-3-5(8)9/h1-3H2,(H,6,7)(H,8,9)
CH$LINK: CAS 110-94-1
CH$LINK: CHEBI 17859
CH$LINK: KEGG C00489
CH$LINK: PUBCHEM 3772
CH$LINK: INCHIKEY JFCQEDHGNNZCLN-UHFFFAOYSA-N
CH$LINK: COMPTOX DTXSID2021654

AC$INSTRUMENT: GCMS-2010 Plus, Shimadzu
AC$INSTRUMENT_TYPE: EI-B
AC$MASS_SPECTROMETRY: MS_TYPE MS
AC$MASS_SPECTROMETRY: ION_MODE POSITIVE
AC$MASS_SPECTROMETRY: GAS_PRESSURE 75 kPa
AC$MASS_SPECTROMETRY: ION_SOURCE_TEMPERATURE 200 C
AC$MASS_SPECTROMETRY: SCAN_RANGE_M/Z 85-500
AC$CHROMATOGRAPHY: COLUMN_NAME InertCap 5MS/NP 0.25 mmI.D. x 30 m, df=0.25 um
AC$CHROMATOGRAPHY: INJECTION_TEMPERATURE 230 C
AC$CHROMATOGRAPHY: OVEN_TEMPERATURE 80 C(2 min)-15 C/min - 330C
AC$CHROMATOGRAPHY: RETENTION_INDEX 1406
AC$CHROMATOGRAPHY: RETENTION_TIME 527.64
AC$CHROMATOGRAPHY: TRANSFARLINE_TEMPERATURE 250 C

MS$FOCUSED_ION: DERIVATIVE_TYPE 2 TMS
MS$DATA_PROCESSING: WHOLE GCMSsolution

PK$SPLASH: splash10-0002-0920000000-56bce366cac24cd6773f
PK$NUM_PEAK: 364
PK$PEAK: m/z int. rel.int.
  86.050000 1545.000000 5
  87.050000 1781.000000 6
  88.100000 4052.000000 14
  89.000000 3466.000000 12
  90.000000 628.000000 2
  91.000000 444.000000 2
  92.000000 5.000000 1
  93.000000 153.000000 1
  94.000000 114.000000 1
  95.000000 748.000000 3
  96.000000 626.000000 2
  97.050000 40955.000000 143
  98.050000 3072.000000 11
  99.050000 5075.000000 18
  100.050000 932.000000 3
  101.050000 7537.000000 26
  102.000000 1657.000000 6
  103.000000 1719.000000 6
  104.000000 337.000000 1
  105.000000 1006.000000 4
  106.000000 22.000000 1
  107.000000 102.000000 1
  108.000000 44.000000 1
  109.000000 175.000000 1
  110.000000 84.000000 1
  111.000000 361.000000 1
  112.000000 42.000000 1
  113.100000 3588.000000 13
  114.100000 436.000000 2
  115.050000 4721.000000 16
  116.050000 28956.000000 101
  117.100000 15378.000000 54
  118.050000 2316.000000 8
  119.100000 1628.000000 6
  120.100000 156.000000 1
  121.100000 174.000000 1
  122.100000 30.000000 1
  123.100000 5420.000000 19
  124.050000 778.000000 3
  125.100000 263.000000 1
  126.100000 92.000000 1
  127.100000 1926.000000 7
  128.150000 919.000000 3
  129.050000 35308.000000 123
  130.100000 22463.000000 78
  131.100000 9150.000000 32
  132.050000 2280.000000 8
  133.050000 15043.000000 53
  134.100000 2410.000000 8
  135.050000 1634.000000 6
  136.100000 57.000000 1
  137.100000 156.000000 1
  138.100000 89.000000 1
  139.100000 65.000000 1
  140.100000 36.000000 1
  141.100000 38.000000 1
  142.100000 694.000000 2
  143.100000 3948.000000 14
  144.100000 479.000000 2
  145.050000 5437.000000 19
  146.150000 1117.000000 4
  147.100000 285985.000000 999
  148.100000 44705.000000 156
  149.100000 39612.000000 138
  150.050000 4744.000000 17
  151.100000 1553.000000 5
  152.100000 209.000000 1
  153.100000 137.000000 1
  154.100000 54.000000 1
  155.100000 62.000000 1
  156.100000 127.000000 1
  157.100000 386.000000 1
  158.100000 61326.000000 214
  159.100000 16505.000000 58
  160.100000 4054.000000 14
  161.100000 972.000000 3
  162.100000 3162.000000 11
  163.100000 1265.000000 4
  164.100000 292.000000 1
  165.100000 276.000000 1
  166.100000 76.000000 1
  167.100000 121.000000 1
  168.100000 58.000000 1
  169.100000 140.000000 1
  170.100000 47.000000 1
  171.050000 1922.000000 7
  172.100000 255.000000 1
  173.100000 399.000000 1
  174.100000 86.000000 1
  175.100000 130.000000 1
  176.100000 58.000000 1
  177.100000 10.000000 1
  178.100000 70.000000 1
  179.100000 135.000000 1
  180.100000 26.000000 1
  182.100000 66.000000 1
  183.100000 3.000000 1
  184.100000 108.000000 1
  185.000000 217.000000 1
  186.050000 21001.000000 73
  187.050000 9654.000000 34
  188.050000 1956.000000 7
  189.000000 7911.000000 28
  190.050000 1460.000000 5
  191.000000 1295.000000 5
  192.000000 204.000000 1
  193.000000 121.000000 1
  194.000000 135.000000 1
  195.000000 135.000000 1
  196.000000 11.000000 1
  197.000000 46.000000 1
  198.000000 14.000000 1
  199.000000 82.000000 1
  201.000000 892.000000 3
  202.000000 202.000000 1
  203.000000 18713.000000 65
  204.050000 21516.000000 75
  205.000000 4742.000000 17
  206.050000 1856.000000 6
  207.100000 329.000000 1
  208.100000 36.000000 1
  209.100000 126.000000 1
  212.100000 11.000000 1
  213.100000 71.000000 1
  214.100000 29.000000 1
  215.100000 122.000000 1
  217.000000 2116.000000 7
  218.000000 625.000000 2
  219.050000 2296.000000 8
  220.000000 630.000000 2
  221.000000 420.000000 1
  222.000000 34.000000 1
  224.000000 41.000000 1
  225.000000 68.000000 1
  227.000000 24.000000 1
  228.000000 73.000000 1
  229.000000 34.000000 1
  230.000000 81.000000 1
  231.000000 11.000000 1
  232.000000 273.000000 1
  233.050000 29165.000000 102
  234.050000 6254.000000 22
  235.050000 3150.000000 11
  236.100000 321.000000 1
  237.100000 164.000000 1
  238.100000 16.000000 1
  242.100000 55.000000 1
  243.100000 169.000000 1
  244.100000 47.000000 1
  245.100000 212.000000 1
  246.100000 100.000000 1
  247.100000 137.000000 1
  248.100000 97.000000 1
  249.100000 151.000000 1
  250.100000 89.000000 1
  251.100000 10.000000 1
  252.100000 13.000000 1
  253.100000 255.000000 1
  254.100000 158.000000 1
  255.100000 73.000000 1
  256.100000 24.000000 1
  257.100000 39.000000 1
  258.100000 52.000000 1
  259.100000 73.000000 1
  260.000000 36.000000 1
  261.050000 64506.000000 225
  262.050000 15197.000000 53
  263.050000 6258.000000 22
  264.000000 1226.000000 4
  265.000000 150.000000 1
  266.000000 98.000000 1
  267.000000 89.000000 1
  269.000000 50.000000 1
  270.000000 105.000000 1
  272.000000 150.000000 1
  273.000000 58.000000 1
  274.000000 68.000000 1
  275.000000 66.000000 1
  276.000000 354.000000 1
  277.000000 76.000000 1
  278.000000 175.000000 1
  279.000000 138.000000 1
  280.000000 38.000000 1
  281.000000 102.000000 1
  282.000000 34.000000 1
  283.000000 106.000000 1
  284.000000 126.000000 1
  285.000000 63.000000 1
  286.000000 81.000000 1
  287.000000 13.000000 1
  288.000000 24.000000 1
  289.000000 84.000000 1
  290.000000 100.000000 1
  291.000000 24.000000 1
  292.000000 73.000000 1
  293.000000 29.000000 1
  294.000000 41.000000 1
  295.000000 70.000000 1
  296.000000 54.000000 1
  297.000000 137.000000 1
  298.000000 126.000000 1
  299.000000 134.000000 1
  300.000000 66.000000 1
  301.000000 166.000000 1
  302.000000 92.000000 1
  303.000000 42.000000 1
  304.000000 24.000000 1
  306.000000 8.000000 1
  307.000000 29.000000 1
  308.000000 42.000000 1
  309.000000 92.000000 1
  310.000000 38.000000 1
  311.000000 30.000000 1
  312.000000 26.000000 1
  313.000000 113.000000 1
  314.000000 113.000000 1
  316.000000 6.000000 1
  317.000000 33.000000 1
  318.000000 116.000000 1
  319.000000 100.000000 1
  321.000000 27.000000 1
  322.000000 47.000000 1
  323.000000 38.000000 1
  324.000000 66.000000 1
  325.000000 63.000000 1
  326.000000 19.000000 1
  327.000000 65.000000 1
  329.000000 87.000000 1
  331.000000 90.000000 1
  332.000000 78.000000 1
  333.000000 38.000000 1
  334.000000 95.000000 1
  335.000000 76.000000 1
  337.000000 87.000000 1
  338.000000 130.000000 1
  343.000000 92.000000 1
  344.000000 26.000000 1
  345.000000 49.000000 1
  346.000000 60.000000 1
  348.000000 76.000000 1
  349.000000 70.000000 1
  351.000000 6.000000 1
  353.000000 63.000000 1
  354.000000 55.000000 1
  355.000000 18.000000 1
  356.000000 29.000000 1
  357.000000 90.000000 1
  358.000000 134.000000 1
  359.000000 54.000000 1
  360.000000 21.000000 1
  361.000000 49.000000 1
  364.000000 103.000000 1
  366.000000 114.000000 1
  368.000000 106.000000 1
  370.000000 66.000000 1
  372.000000 39.000000 1
  373.000000 82.000000 1
  374.000000 29.000000 1
  375.000000 13.000000 1
  376.000000 31.000000 1
  378.000000 60.000000 1
  379.000000 50.000000 1
  380.000000 19.000000 1
  381.000000 76.000000 1
  382.000000 98.000000 1
  384.000000 94.000000 1
  385.000000 105.000000 1
  386.000000 5.000000 1
  387.000000 5.000000 1
  388.000000 116.000000 1
  389.000000 57.000000 1
  390.000000 66.000000 1
  391.000000 70.000000 1
  392.000000 132.000000 1
  393.000000 54.000000 1
  394.000000 81.000000 1
  395.000000 49.000000 1
  396.000000 86.000000 1
  397.000000 82.000000 1
  398.000000 49.000000 1
  399.000000 58.000000 1
  401.000000 73.000000 1
  402.000000 98.000000 1
  403.000000 41.000000 1
  404.000000 8.000000 1
  405.000000 100.000000 1
  406.000000 132.000000 1
  407.000000 39.000000 1
  409.000000 68.000000 1
  411.000000 31.000000 1
  412.000000 44.000000 1
  413.000000 95.000000 1
  414.000000 74.000000 1
  416.000000 57.000000 1
  418.000000 6.000000 1
  419.000000 5.000000 1
  420.000000 5.000000 1
  421.000000 49.000000 1
  422.000000 66.000000 1
  423.000000 118.000000 1
  424.000000 2.000000 1
  425.000000 105.000000 1
  426.000000 94.000000 1
  427.000000 98.000000 1
  428.000000 82.000000 1
  429.000000 78.000000 1
  431.000000 27.000000 1
  432.000000 10.000000 1
  433.000000 34.000000 1
  434.000000 38.000000 1
  435.000000 63.000000 1
  436.000000 105.000000 1
  437.000000 116.000000 1
  439.000000 16.000000 1
  441.000000 116.000000 1
  442.000000 30.000000 1
  443.000000 76.000000 1
  444.000000 27.000000 1
  447.000000 58.000000 1
  448.000000 26.000000 1
  449.000000 42.000000 1
  450.000000 76.000000 1
  453.000000 54.000000 1
  455.000000 2.000000 1
  456.000000 60.000000 1
  457.000000 140.000000 1
  459.000000 41.000000 1
  460.000000 55.000000 1
  461.000000 108.000000 1
  462.000000 95.000000 1
  463.000000 89.000000 1
  464.000000 47.000000 1
  465.000000 30.000000 1
  466.000000 13.000000 1
  467.000000 29.000000 1
  468.000000 76.000000 1
  470.000000 42.000000 1
  471.000000 3.000000 1
  473.000000 6.000000 1
  474.000000 50.000000 1
  475.000000 34.000000 1
  476.000000 38.000000 1
  477.000000 76.000000 1
  478.000000 6.000000 1
  479.000000 19.000000 1
  480.000000 76.000000 1
  481.000000 36.000000 1
  482.000000 19.000000 1
  483.000000 66.000000 1
  484.000000 16.000000 1
  485.000000 90.000000 1
  486.000000 47.000000 1
  487.000000 60.000000 1
  488.000000 66.000000 1
  489.000000 18.000000 1
  490.000000 6.000000 1
  491.000000 94.000000 1
  492.000000 114.000000 1
  493.000000 19.000000 1
  494.000000 19.000000 1
  495.000000 33.000000 1
  496.000000 31.000000 1
  497.000000 202.000000 1
  498.000000 39.000000 1