ACCESSION: MSBNK-GL_Sciences_Inc-GLS00139
RECORD_TITLE: Pyrogallol; EI-B; MS; n TMS; RT: 612.56 s
DATE: 2016.01.19 (Created 2012.08.03, modified 2013.07.31)
AUTHORS: Miyagawa H, Akimoto S, Yamasaki K, GL Sciences Inc.
LICENSE: CC BY-SA
COPYRIGHT: GLS
COMMENT: The chemical compound was chemically modified with N-methyl-N-trimethylsilyl-trifluoroacetamide(MSTFA) before GC-MS analysis. When it has two or more functional groups, this modification gave a mixture of the TMS derivatives having different number of TMS groups at different functional groups.

CH$NAME: Pyrogallol
CH$COMPOUND_CLASS: Natural Product
CH$FORMULA: C6H6O3
CH$EXACT_MASS: 126.03169
CH$SMILES: Oc(c1)c(O)c(O)cc1
CH$IUPAC: InChI=1S/C6H6O3/c7-4-2-1-3-5(8)6(4)9/h1-3,7-9H
CH$LINK: CAS 87-66-1
CH$LINK: CHEBI 16164
CH$LINK: KEGG C01108
CH$LINK: PUBCHEM 4340
CH$LINK: INCHIKEY WQGWDDDVZFFDIG-UHFFFAOYSA-N
CH$LINK: COMPTOX DTXSID6025983

AC$INSTRUMENT: GCMS-2010 Plus, Shimadzu
AC$INSTRUMENT_TYPE: EI-B
AC$MASS_SPECTROMETRY: MS_TYPE MS
AC$MASS_SPECTROMETRY: ION_MODE POSITIVE
AC$MASS_SPECTROMETRY: GAS_PRESSURE 75 kPa
AC$MASS_SPECTROMETRY: ION_SOURCE_TEMPERATURE 200 C
AC$MASS_SPECTROMETRY: SCAN_RANGE_M/Z 85-500
AC$CHROMATOGRAPHY: COLUMN_NAME InertCap 5MS/NP 0.25 mmI.D. x 30 m, df=0.25 um
AC$CHROMATOGRAPHY: INJECTION_TEMPERATURE 230 C
AC$CHROMATOGRAPHY: OVEN_TEMPERATURE 80 C(2 min)-15 C/min - 330C
AC$CHROMATOGRAPHY: RETENTION_INDEX 1561
AC$CHROMATOGRAPHY: RETENTION_TIME 612.56
AC$CHROMATOGRAPHY: TRANSFARLINE_TEMPERATURE 250 C

MS$FOCUSED_ION: DERIVATIVE_TYPE n TMS
MS$DATA_PROCESSING: WHOLE GCMSsolution

PK$SPLASH: splash10-000l-0293000000-317381c3955975af27a6
PK$NUM_PEAK: 377
PK$PEAK: m/z int. rel.int.
  86.000000 174.000000 1
  87.050000 1563.000000 3
  88.000000 302.000000 1
  89.000000 2679.000000 4
  90.100000 654.000000 1
  91.050000 13390.000000 22
  92.100000 1855.000000 3
  93.050000 31425.000000 51
  94.100000 2545.000000 4
  95.000000 2335.000000 4
  96.000000 233.000000 1
  97.050000 1553.000000 3
  98.100000 743.000000 1
  99.050000 1283.000000 2
  100.100000 318.000000 1
  101.100000 670.000000 1
  102.000000 758.000000 1
  103.000000 7695.000000 12
  104.050000 1807.000000 3
  105.050000 9416.000000 15
  106.000000 1169.000000 2
  107.050000 1940.000000 3
  108.000000 506.000000 1
  109.050000 2244.000000 4
  110.100000 438.000000 1
  111.100000 529.000000 1
  112.100000 830.000000 1
  113.100000 706.000000 1
  114.000000 39.000000 1
  115.050000 5342.000000 9
  116.050000 1045.000000 2
  117.000000 3958.000000 6
  118.050000 997.000000 2
  119.050000 16530.000000 27
  120.000000 2526.000000 4
  121.000000 2761.000000 4
  122.000000 575.000000 1
  123.050000 1142.000000 2
  124.000000 278.000000 1
  125.000000 207.000000 1
  126.000000 214.000000 1
  127.000000 268.000000 1
  128.000000 129.000000 1
  129.000000 1204.000000 2
  130.000000 153.000000 1
  131.050000 8808.000000 14
  132.050000 1398.000000 2
  133.000000 61412.000000 100
  134.050000 7470.000000 12
  135.050000 9091.000000 15
  136.050000 1451.000000 2
  137.000000 4276.000000 7
  138.000000 609.000000 1
  139.000000 340.000000 1
  140.000000 97.000000 1
  141.000000 332.000000 1
  142.000000 140.000000 1
  143.000000 2444.000000 4
  144.000000 401.000000 1
  145.100000 1196.000000 2
  146.100000 313.000000 1
  147.100000 27458.000000 45
  148.100000 4324.000000 7
  149.050000 7100.000000 12
  150.000000 817.000000 1
  151.000000 2806.000000 5
  152.000000 620.000000 1
  153.000000 1770.000000 3
  154.000000 380.000000 1
  155.000000 278.000000 1
  156.000000 182.000000 1
  157.050000 1496.000000 2
  158.000000 334.000000 1
  159.000000 438.000000 1
  160.000000 175.000000 1
  161.050000 1221.000000 2
  162.000000 366.000000 1
  163.050000 2248.000000 4
  164.000000 702.000000 1
  165.000000 1551.000000 3
  166.000000 887.000000 1
  166.950000 1173.000000 2
  168.000000 354.000000 1
  169.000000 473.000000 1
  170.000000 16.000000 1
  171.000000 249.000000 1
  172.000000 100.000000 1
  173.000000 206.000000 1
  174.000000 116.000000 1
  175.000000 503.000000 1
  176.000000 234.000000 1
  177.000000 2634.000000 4
  178.000000 649.000000 1
  179.000000 13374.000000 22
  180.050000 2257.000000 4
  180.950000 2794.000000 5
  182.000000 770.000000 1
  183.000000 750.000000 1
  184.000000 180.000000 1
  185.000000 24.000000 1
  186.000000 42.000000 1
  187.000000 106.000000 1
  188.000000 76.000000 1
  189.000000 1532.000000 2
  190.000000 273.000000 1
  190.950000 4642.000000 8
  192.000000 1278.000000 2
  193.000000 8094.000000 13
  194.000000 1644.000000 3
  194.950000 3904.000000 6
  195.950000 3382.000000 5
  196.950000 2213.000000 4
  198.000000 543.000000 1
  199.000000 244.000000 1
  201.000000 254.000000 1
  202.000000 55.000000 1
  203.000000 231.000000 1
  204.000000 13.000000 1
  205.000000 1599.000000 3
  206.000000 249.000000 1
  207.000000 3281.000000 5
  207.950000 975.000000 2
  208.950000 4930.000000 8
  210.050000 1192.000000 2
  211.000000 71767.000000 117
  212.000000 13686.000000 22
  212.950000 6634.000000 11
  214.000000 719.000000 1
  215.000000 265.000000 1
  216.000000 33.000000 1
  217.000000 252.000000 1
  218.000000 206.000000 1
  219.000000 642.000000 1
  220.000000 242.000000 1
  221.000000 818.000000 1
  222.000000 348.000000 1
  222.950000 1535.000000 2
  224.000000 502.000000 1
  225.000000 921.000000 1
  226.000000 250.000000 1
  227.000000 103.000000 1
  228.000000 44.000000 1
  229.000000 29.000000 1
  231.000000 5.000000 1
  232.000000 49.000000 1
  233.000000 260.000000 1
  234.000000 13.000000 1
  235.000000 489.000000 1
  236.000000 126.000000 1
  237.000000 4204.000000 7
  238.050000 2530.000000 4
  239.000000 615049.000000 999
  240.000000 123697.000000 201
  241.000000 52511.000000 85
  241.950000 6840.000000 11
  243.000000 1855.000000 3
  244.000000 97.000000 1
  245.000000 44.000000 1
  246.000000 19.000000 1
  247.000000 111.000000 1
  248.000000 39.000000 1
  249.000000 506.000000 1
  250.000000 159.000000 1
  250.950000 2989.000000 5
  252.050000 821.000000 1
  253.000000 3169.000000 5
  254.000000 7178.000000 12
  255.000000 1905.000000 3
  256.000000 564.000000 1
  257.000000 154.000000 1
  258.000000 49.000000 1
  259.000000 6.000000 1
  260.000000 13.000000 1
  261.000000 24.000000 1
  262.000000 33.000000 1
  263.000000 33.000000 1
  264.000000 106.000000 1
  265.000000 542.000000 1
  266.000000 295.000000 1
  267.050000 3746.000000 6
  268.050000 1115.000000 2
  269.100000 1631.000000 3
  270.100000 498.000000 1
  271.100000 281.000000 1
  272.100000 71.000000 1
  274.100000 22.000000 1
  275.100000 36.000000 1
  276.100000 79.000000 1
  277.100000 63.000000 1
  278.100000 82.000000 1
  279.100000 150.000000 1
  280.100000 44.000000 1
  281.100000 407.000000 1
  282.100000 73.000000 1
  283.100000 110.000000 1
  284.100000 38.000000 1
  285.100000 68.000000 1
  286.100000 30.000000 1
  287.100000 38.000000 1
  289.100000 71.000000 1
  290.100000 63.000000 1
  291.100000 30.000000 1
  292.100000 57.000000 1
  293.100000 119.000000 1
  294.100000 106.000000 1
  295.100000 142.000000 1
  296.100000 105.000000 1
  297.100000 354.000000 1
  298.100000 119.000000 1
  299.100000 150.000000 1
  300.100000 79.000000 1
  301.100000 22.000000 1
  302.100000 68.000000 1
  303.100000 31.000000 1
  305.100000 89.000000 1
  306.100000 62.000000 1
  307.100000 27.000000 1
  308.100000 58.000000 1
  309.100000 151.000000 1
  310.100000 89.000000 1
  311.100000 1193.000000 2
  312.100000 300.000000 1
  313.100000 198.000000 1
  314.100000 71.000000 1
  315.100000 60.000000 1
  316.100000 102.000000 1
  317.100000 31.000000 1
  318.100000 33.000000 1
  321.100000 118.000000 1
  322.100000 98.000000 1
  323.100000 82.000000 1
  324.100000 84.000000 1
  325.100000 351.000000 1
  326.100000 324.000000 1
  327.050000 47421.000000 77
  328.050000 14889.000000 24
  329.050000 6727.000000 11
  330.100000 1782.000000 3
  331.100000 502.000000 1
  332.100000 126.000000 1
  333.100000 103.000000 1
  335.100000 54.000000 1
  336.100000 114.000000 1
  338.100000 79.000000 1
  339.100000 124.000000 1
  340.100000 111.000000 1
  341.150000 1941.000000 3
  342.100000 219177.000000 356
  343.050000 68044.000000 111
  344.050000 34191.000000 56
  345.050000 8009.000000 13
  346.100000 2020.000000 3
  347.100000 260.000000 1
  348.100000 140.000000 1
  352.100000 54.000000 1
  353.100000 3.000000 1
  354.100000 70.000000 1
  355.100000 73.000000 1
  356.100000 164.000000 1
  357.100000 46.000000 1
  358.100000 68.000000 1
  360.100000 60.000000 1
  361.100000 6.000000 1
  362.100000 41.000000 1
  364.100000 36.000000 1
  365.100000 89.000000 1
  366.100000 105.000000 1
  368.100000 13.000000 1
  369.100000 42.000000 1
  370.100000 95.000000 1
  371.100000 65.000000 1
  372.100000 66.000000 1
  373.100000 38.000000 1
  374.100000 98.000000 1
  375.100000 103.000000 1
  376.100000 19.000000 1
  377.100000 29.000000 1
  378.100000 95.000000 1
  379.100000 71.000000 1
  381.100000 52.000000 1
  382.100000 100.000000 1
  383.100000 74.000000 1
  384.100000 114.000000 1
  386.100000 71.000000 1
  387.100000 105.000000 1
  388.100000 68.000000 1
  389.100000 2.000000 1
  390.100000 52.000000 1
  391.100000 57.000000 1
  392.100000 36.000000 1
  394.100000 124.000000 1
  395.100000 29.000000 1
  396.100000 47.000000 1
  397.100000 16.000000 1
  399.100000 62.000000 1
  400.100000 60.000000 1
  401.100000 18.000000 1
  402.100000 57.000000 1
  403.100000 81.000000 1
  404.100000 29.000000 1
  405.100000 92.000000 1
  406.100000 114.000000 1
  407.100000 76.000000 1
  408.100000 22.000000 1
  409.100000 105.000000 1
  410.100000 78.000000 1
  411.100000 73.000000 1
  412.100000 81.000000 1
  415.100000 68.000000 1
  416.100000 46.000000 1
  417.100000 138.000000 1
  419.100000 66.000000 1
  420.100000 50.000000 1
  422.100000 22.000000 1
  423.100000 86.000000 1
  424.100000 113.000000 1
  425.100000 30.000000 1
  426.100000 60.000000 1
  427.100000 122.000000 1
  428.100000 38.000000 1
  429.100000 106.000000 1
  430.100000 158.000000 1
  432.100000 36.000000 1
  433.100000 74.000000 1
  434.100000 86.000000 1
  435.100000 29.000000 1
  436.100000 29.000000 1
  437.100000 55.000000 1
  438.100000 10.000000 1
  439.100000 38.000000 1
  440.100000 57.000000 1
  441.100000 50.000000 1
  442.100000 18.000000 1
  443.100000 47.000000 1
  444.100000 33.000000 1
  445.100000 27.000000 1
  446.100000 6.000000 1
  447.100000 70.000000 1
  449.100000 84.000000 1
  450.100000 44.000000 1
  451.100000 34.000000 1
  452.100000 65.000000 1
  453.100000 46.000000 1
  455.100000 102.000000 1
  456.100000 52.000000 1
  458.100000 95.000000 1
  460.100000 6.000000 1
  461.100000 38.000000 1
  462.100000 60.000000 1
  464.100000 19.000000 1
  466.100000 57.000000 1
  467.100000 70.000000 1
  468.100000 94.000000 1
  469.100000 46.000000 1
  470.100000 55.000000 1
  471.100000 41.000000 1
  473.100000 57.000000 1
  474.100000 13.000000 1
  475.100000 65.000000 1
  477.100000 106.000000 1
  478.100000 24.000000 1
  480.100000 132.000000 1
  481.100000 55.000000 1
  482.100000 73.000000 1
  483.100000 57.000000 1
  484.100000 29.000000 1
  487.100000 84.000000 1
  488.100000 87.000000 1
  489.100000 108.000000 1
  490.100000 135.000000 1
  492.100000 92.000000 1
  493.100000 92.000000 1
  494.100000 100.000000 1
  495.100000 16.000000 1
  496.100000 44.000000 1
  497.100000 33.000000 1
  499.100000 47.000000 1