ACCESSION: MSBNK-GL_Sciences_Inc-GLS00150
RECORD_TITLE: Maleic acid; EI-B; MS; 2 TMS; RT: 469.43 s
DATE: 2016.01.19 (Created 2012.08.03, modified 2013.07.31)
AUTHORS: Miyagawa H, Akimoto S, Yamasaki K, GL Sciences Inc.
LICENSE: CC BY-SA
COPYRIGHT: GLS
COMMENT: The chemical compound was chemically modified with N-methyl-N-trimethylsilyl-trifluoroacetamide(MSTFA) before GC-MS analysis. When it has two or more functional groups, this modification gave a mixture of the TMS derivatives having different number of TMS groups at different functional groups.

CH$NAME: Maleic acid
CH$COMPOUND_CLASS: Natural Product
CH$FORMULA: C4H4O4
CH$EXACT_MASS: 116.01096
CH$SMILES: C(=C\C(=O)O)\C(=O)O
CH$IUPAC: InChI=1S/C4H4O4/c5-3(6)1-2-4(7)8/h1-2H,(H,5,6)(H,7,8)/b2-1-
CH$LINK: CAS 110-16-7
CH$LINK: CHEBI 18300
CH$LINK: KEGG C01384
CH$LINK: PUBCHEM CID:444266
CH$LINK: INCHIKEY VZCYOOQTPOCHFL-UPHRSURJSA-N
CH$LINK: COMPTOX DTXSID8021517

AC$INSTRUMENT: GCMS-2010 Plus, Shimadzu
AC$INSTRUMENT_TYPE: EI-B
AC$MASS_SPECTROMETRY: MS_TYPE MS
AC$MASS_SPECTROMETRY: ION_MODE POSITIVE
AC$MASS_SPECTROMETRY: GAS_PRESSURE 75 kPa
AC$MASS_SPECTROMETRY: ION_SOURCE_TEMPERATURE 200 C
AC$MASS_SPECTROMETRY: SCAN_RANGE_M/Z 85-500
AC$CHROMATOGRAPHY: COLUMN_NAME InertCap 5MS/NP 0.25 mmI.D. x 30 m, df=0.25 um
AC$CHROMATOGRAPHY: INJECTION_TEMPERATURE 230 C
AC$CHROMATOGRAPHY: OVEN_TEMPERATURE 80 C(2 min)-15 C/min - 330C
AC$CHROMATOGRAPHY: RETENTION_INDEX 1309
AC$CHROMATOGRAPHY: RETENTION_TIME 469.43
AC$CHROMATOGRAPHY: TRANSFARLINE_TEMPERATURE 250 C

MS$FOCUSED_ION: DERIVATIVE_TYPE 2 TMS
MS$DATA_PROCESSING: WHOLE GCMSsolution

PK$SPLASH: splash10-0002-0910000000-15f30f525d5ea74dc9d4
PK$NUM_PEAK: 333
PK$PEAK: m/z int. rel.int.
  86.000000 391.000000 2
  87.000000 647.000000 3
  88.000000 154.000000 1
  89.000000 396.000000 2
  90.000000 29.000000 1
  91.000000 194.000000 1
  92.000000 114.000000 1
  93.000000 153.000000 1
  94.000000 34.000000 1
  95.000000 169.000000 1
  96.000000 137.000000 1
  97.000000 436.000000 2
  98.100000 3914.000000 17
  99.000000 1186.000000 5
  100.000000 422.000000 2
  101.000000 626.000000 3
  102.000000 222.000000 1
  103.000000 1182.000000 5
  104.000000 247.000000 1
  105.000000 730.000000 3
  106.000000 143.000000 1
  107.000000 178.000000 1
  108.000000 49.000000 1
  109.000000 66.000000 1
  110.000000 142.000000 1
  111.000000 975.000000 4
  112.000000 140.000000 1
  113.000000 1316.000000 6
  114.100000 519.000000 2
  115.050000 8927.000000 39
  116.050000 1157.000000 5
  117.000000 2876.000000 13
  118.000000 460.000000 2
  119.000000 1116.000000 5
  120.000000 150.000000 1
  121.000000 174.000000 1
  122.000000 63.000000 1
  123.000000 114.000000 1
  124.000000 145.000000 1
  125.000000 137.000000 1
  126.050000 5030.000000 22
  127.050000 1277.000000 6
  128.100000 1017.000000 4
  129.100000 694.000000 3
  130.000000 151.000000 1
  131.050000 4071.000000 18
  132.000000 1134.000000 5
  133.050000 9940.000000 44
  134.000000 1278.000000 6
  135.000000 962.000000 4
  136.000000 172.000000 1
  137.000000 100.000000 1
  139.000000 13.000000 1
  140.000000 38.000000 1
  141.000000 177.000000 1
  142.100000 1193.000000 5
  143.050000 7514.000000 33
  144.100000 908.000000 4
  145.100000 420.000000 2
  146.100000 567.000000 2
  147.100000 227458.000000 999
  148.100000 34449.000000 151
  149.100000 19732.000000 87
  150.050000 2111.000000 9
  151.000000 406.000000 2
  152.000000 6.000000 1
  153.000000 81.000000 1
  154.000000 50.000000 1
  155.100000 1206.000000 5
  156.100000 518.000000 2
  157.100000 1743.000000 8
  158.100000 407.000000 2
  159.100000 633.000000 3
  160.100000 111.000000 1
  161.100000 134.000000 1
  162.100000 36.000000 1
  163.100000 81.000000 1
  164.100000 92.000000 1
  167.100000 62.000000 1
  168.100000 33.000000 1
  169.000000 14.000000 1
  170.000000 4887.000000 21
  171.100000 1673.000000 7
  172.100000 263.000000 1
  173.100000 652.000000 3
  174.100000 143.000000 1
  175.100000 158.000000 1
  176.100000 98.000000 1
  178.100000 3.000000 1
  179.100000 73.000000 1
  180.100000 122.000000 1
  181.100000 21.000000 1
  182.100000 31.000000 1
  183.100000 2.000000 1
  184.100000 105.000000 1
  185.100000 87.000000 1
  186.100000 76.000000 1
  187.100000 71.000000 1
  188.100000 73.000000 1
  189.100000 11.000000 1
  190.100000 31.000000 1
  191.100000 13.000000 1
  193.100000 55.000000 1
  194.100000 81.000000 1
  195.100000 102.000000 1
  196.100000 22.000000 1
  198.100000 14.000000 1
  199.100000 70.000000 1
  200.100000 98.000000 1
  201.100000 351.000000 2
  202.100000 8.000000 1
  203.100000 94.000000 1
  205.100000 84.000000 1
  206.100000 70.000000 1
  207.100000 92.000000 1
  208.100000 63.000000 1
  209.100000 95.000000 1
  210.100000 18.000000 1
  213.100000 24.000000 1
  214.100000 300.000000 1
  215.050000 2866.000000 13
  216.100000 662.000000 3
  217.100000 911.000000 4
  218.100000 278.000000 1
  219.100000 295.000000 1
  220.100000 47.000000 1
  221.100000 103.000000 1
  222.100000 41.000000 1
  223.100000 11.000000 1
  224.100000 29.000000 1
  225.100000 68.000000 1
  226.100000 70.000000 1
  228.100000 52.000000 1
  229.100000 113.000000 1
  230.100000 42.000000 1
  231.100000 38.000000 1
  233.100000 42.000000 1
  235.100000 63.000000 1
  237.100000 86.000000 1
  238.100000 97.000000 1
  239.100000 34.000000 1
  241.100000 119.000000 1
  242.050000 1931.000000 8
  243.100000 455.000000 2
  244.000000 263.000000 1
  245.050000 29555.000000 130
  246.000000 5985.000000 26
  247.000000 2762.000000 12
  248.000000 455.000000 2
  249.000000 215.000000 1
  250.000000 79.000000 1
  252.000000 31.000000 1
  253.000000 204.000000 1
  254.000000 206.000000 1
  255.000000 78.000000 1
  256.000000 3.000000 1
  259.000000 89.000000 1
  260.000000 81.000000 1
  263.000000 29.000000 1
  264.000000 174.000000 1
  265.000000 57.000000 1
  267.000000 13.000000 1
  268.000000 106.000000 1
  269.000000 118.000000 1
  270.000000 108.000000 1
  271.000000 27.000000 1
  273.000000 90.000000 1
  274.000000 31.000000 1
  276.000000 105.000000 1
  277.000000 36.000000 1
  278.000000 13.000000 1
  279.000000 54.000000 1
  280.000000 19.000000 1
  281.000000 46.000000 1
  282.000000 5.000000 1
  284.000000 49.000000 1
  285.000000 6.000000 1
  288.000000 13.000000 1
  289.000000 86.000000 1
  290.000000 54.000000 1
  291.000000 58.000000 1
  292.000000 13.000000 1
  294.000000 97.000000 1
  295.000000 47.000000 1
  296.000000 49.000000 1
  297.000000 49.000000 1
  298.000000 81.000000 1
  299.000000 18.000000 1
  300.000000 90.000000 1
  302.000000 11.000000 1
  303.000000 135.000000 1
  304.000000 73.000000 1
  307.000000 26.000000 1
  308.000000 86.000000 1
  309.000000 98.000000 1
  310.000000 63.000000 1
  311.000000 55.000000 1
  312.000000 34.000000 1
  313.000000 21.000000 1
  314.000000 90.000000 1
  315.000000 34.000000 1
  316.000000 33.000000 1
  317.000000 113.000000 1
  318.000000 34.000000 1
  319.000000 29.000000 1
  322.000000 26.000000 1
  323.000000 36.000000 1
  327.000000 11.000000 1
  328.000000 22.000000 1
  329.000000 41.000000 1
  331.000000 63.000000 1
  332.000000 2.000000 1
  333.000000 6.000000 1
  334.000000 50.000000 1
  335.000000 44.000000 1
  336.000000 55.000000 1
  339.000000 105.000000 1
  340.000000 52.000000 1
  342.000000 21.000000 1
  343.000000 47.000000 1
  344.000000 110.000000 1
  346.000000 116.000000 1
  348.000000 44.000000 1
  349.000000 127.000000 1
  350.000000 63.000000 1
  352.000000 11.000000 1
  353.000000 60.000000 1
  354.000000 33.000000 1
  356.000000 8.000000 1
  357.000000 5.000000 1
  358.000000 129.000000 1
  359.000000 73.000000 1
  360.000000 102.000000 1
  361.000000 57.000000 1
  362.000000 30.000000 1
  363.000000 58.000000 1
  364.000000 33.000000 1
  365.000000 58.000000 1
  366.000000 54.000000 1
  367.000000 22.000000 1
  369.000000 33.000000 1
  370.000000 46.000000 1
  371.000000 102.000000 1
  372.000000 102.000000 1
  373.000000 33.000000 1
  374.000000 27.000000 1
  375.000000 52.000000 1
  376.000000 2.000000 1
  378.000000 58.000000 1
  382.000000 47.000000 1
  383.000000 31.000000 1
  384.000000 29.000000 1
  385.000000 16.000000 1
  387.000000 24.000000 1
  388.000000 18.000000 1
  389.000000 5.000000 1
  390.000000 70.000000 1
  391.000000 21.000000 1
  392.000000 22.000000 1
  393.000000 19.000000 1
  394.000000 49.000000 1
  396.000000 39.000000 1
  397.000000 73.000000 1
  399.000000 30.000000 1
  400.000000 52.000000 1
  401.000000 84.000000 1
  402.000000 78.000000 1
  403.000000 94.000000 1
  404.000000 57.000000 1
  405.000000 89.000000 1
  407.000000 18.000000 1
  408.000000 119.000000 1
  409.000000 89.000000 1
  410.000000 44.000000 1
  413.000000 58.000000 1
  414.000000 68.000000 1
  416.000000 5.000000 1
  418.000000 44.000000 1
  419.000000 44.000000 1
  420.000000 13.000000 1
  423.000000 29.000000 1
  424.000000 38.000000 1
  425.000000 50.000000 1
  427.000000 46.000000 1
  436.000000 27.000000 1
  437.000000 102.000000 1
  438.000000 8.000000 1
  439.000000 39.000000 1
  440.000000 6.000000 1
  441.000000 24.000000 1
  442.000000 27.000000 1
  443.000000 126.000000 1
  444.000000 19.000000 1
  447.000000 8.000000 1
  448.000000 63.000000 1
  450.000000 38.000000 1
  451.000000 68.000000 1
  452.000000 106.000000 1
  453.000000 60.000000 1
  456.000000 29.000000 1
  457.000000 63.000000 1
  458.000000 47.000000 1
  459.000000 52.000000 1
  461.000000 52.000000 1
  462.000000 3.000000 1
  463.000000 27.000000 1
  465.000000 33.000000 1
  466.000000 30.000000 1
  467.000000 89.000000 1
  468.000000 39.000000 1
  469.000000 41.000000 1
  470.000000 94.000000 1
  472.000000 22.000000 1
  473.000000 24.000000 1
  475.000000 10.000000 1
  476.000000 8.000000 1
  477.000000 62.000000 1
  478.000000 46.000000 1
  479.000000 8.000000 1
  481.000000 16.000000 1
  482.000000 62.000000 1
  483.000000 14.000000 1
  486.000000 22.000000 1
  487.000000 47.000000 1
  488.000000 39.000000 1
  491.000000 79.000000 1
  492.000000 52.000000 1
  494.000000 26.000000 1
  495.000000 36.000000 1
  496.000000 44.000000 1
  497.000000 86.000000 1
  498.000000 44.000000 1
  499.000000 27.000000 1