ACCESSION: MSBNK-GL_Sciences_Inc-GLS00151
RECORD_TITLE: 3-Pyridylacetic acid; EI-B; MS; 1 TMS; RT: 519.19 s
DATE: 2016.01.19 (Created 2012.08.03, modified 2013.07.31)
AUTHORS: Miyagawa H, Akimoto S, Yamasaki K, GL Sciences Inc.
LICENSE: CC BY-SA
COPYRIGHT: GLS
COMMENT: The chemical compound was chemically modified with N-methyl-N-trimethylsilyl-trifluoroacetamide(MSTFA) before GC-MS analysis. When it has two or more functional groups, this modification gave a mixture of the TMS derivatives having different number of TMS groups at different functional groups.

CH$NAME: 3-Pyridylacetic acid
CH$COMPOUND_CLASS: Natural Product
CH$FORMULA: C7H7NO2
CH$EXACT_MASS: 137.04768
CH$SMILES: OC(=O)Cc(c1)cncc1
CH$IUPAC: InChI=1S/C7H7NO2/c9-7(10)4-6-2-1-3-8-5-6/h1-3,5H,4H2,(H,9,10)
CH$LINK: CAS 501-81-5
CH$LINK: INCHIKEY WGNUNYPERJMVRM-UHFFFAOYSA-N
CH$LINK: COMPTOX DTXSID3060110

AC$INSTRUMENT: GCMS-2010 Plus, Shimadzu
AC$INSTRUMENT_TYPE: EI-B
AC$MASS_SPECTROMETRY: MS_TYPE MS
AC$MASS_SPECTROMETRY: ION_MODE POSITIVE
AC$MASS_SPECTROMETRY: GAS_PRESSURE 75 kPa
AC$MASS_SPECTROMETRY: ION_SOURCE_TEMPERATURE 200 C
AC$MASS_SPECTROMETRY: SCAN_RANGE_M/Z 85-500
AC$CHROMATOGRAPHY: COLUMN_NAME InertCap 5MS/NP 0.25 mmI.D. x 30 m, df=0.25 um
AC$CHROMATOGRAPHY: INJECTION_TEMPERATURE 230 C
AC$CHROMATOGRAPHY: OVEN_TEMPERATURE 80 C(2 min)-15 C/min - 330C
AC$CHROMATOGRAPHY: RETENTION_INDEX 1392
AC$CHROMATOGRAPHY: RETENTION_TIME 519.19
AC$CHROMATOGRAPHY: TRANSFARLINE_TEMPERATURE 250 C

MS$FOCUSED_ION: DERIVATIVE_TYPE 1 TMS
MS$DATA_PROCESSING: WHOLE GCMSsolution

PK$SPLASH: splash10-014l-1900000000-c98d84fdf977d74c2474
PK$NUM_PEAK: 342
PK$PEAK: m/z int. rel.int.
  86.000000 156.000000 3
  87.000000 92.000000 2
  88.000000 154.000000 3
  89.000000 602.000000 11
  90.000000 398.000000 7
  91.050000 4185.000000 77
  92.050000 11364.000000 208
  93.100000 2522.000000 46
  94.100000 354.000000 6
  95.100000 546.000000 10
  96.100000 239.000000 4
  97.100000 4481.000000 82
  98.100000 404.000000 7
  99.100000 334.000000 6
  100.100000 239.000000 4
  101.100000 276.000000 5
  102.100000 39.000000 1
  103.100000 92.000000 2
  104.100000 81.000000 1
  105.100000 30.000000 1
  106.100000 458.000000 8
  107.100000 358.000000 7
  108.100000 266.000000 5
  109.100000 79.000000 1
  110.100000 158.000000 3
  111.100000 156.000000 3
  112.100000 29.000000 1
  113.100000 76.000000 1
  114.100000 201.000000 4
  115.100000 16.000000 1
  116.100000 633.000000 12
  117.100000 4934.000000 90
  118.100000 655.000000 12
  119.100000 1674.000000 31
  120.050000 25234.000000 462
  121.050000 1953.000000 36
  122.100000 452.000000 8
  123.100000 242.000000 4
  124.100000 97.000000 2
  125.100000 218.000000 4
  126.100000 81.000000 1
  127.100000 135.000000 2
  128.100000 5.000000 1
  129.100000 21.000000 1
  130.100000 92.000000 2
  131.100000 273.000000 5
  132.100000 190.000000 3
  133.100000 180.000000 3
  134.100000 729.000000 13
  135.100000 313.000000 6
  136.100000 390.000000 7
  137.100000 185.000000 3
  138.100000 655.000000 12
  139.100000 134.000000 2
  140.100000 97.000000 2
  141.100000 2.000000 1
  143.100000 24.000000 1
  146.100000 265.000000 5
  147.100000 162.000000 3
  148.100000 122.000000 2
  149.100000 489.000000 9
  150.100000 474.000000 9
  151.100000 268.000000 5
  152.100000 138.000000 3
  153.100000 14.000000 1
  154.100000 52.000000 1
  155.100000 89.000000 2
  157.100000 36.000000 1
  158.100000 26.000000 1
  160.100000 105.000000 2
  161.100000 119.000000 2
  162.100000 73.000000 1
  163.100000 238.000000 4
  164.100000 356.000000 7
  165.100000 54593.000000 999
  166.100000 8148.000000 149
  167.100000 2191.000000 40
  168.100000 398.000000 7
  169.100000 122.000000 2
  170.100000 46.000000 1
  171.100000 73.000000 1
  172.100000 14.000000 1
  173.100000 38.000000 1
  174.100000 22.000000 1
  176.100000 38.000000 1
  177.100000 27.000000 1
  178.100000 178.000000 3
  179.100000 26.000000 1
  180.100000 210.000000 4
  181.100000 3.000000 1
  183.100000 76.000000 1
  185.100000 6.000000 1
  186.100000 11.000000 1
  187.100000 68.000000 1
  188.100000 30.000000 1
  189.100000 38.000000 1
  190.100000 31.000000 1
  191.100000 30.000000 1
  192.100000 138.000000 3
  193.000000 434.000000 8
  194.000000 31722.000000 580
  195.050000 4820.000000 88
  196.100000 1394.000000 26
  197.100000 148.000000 3
  198.100000 89.000000 2
  200.100000 79.000000 1
  203.100000 68.000000 1
  204.100000 10.000000 1
  205.100000 44.000000 1
  208.100000 167.000000 3
  209.100000 8521.000000 156
  210.050000 1597.000000 29
  211.000000 468.000000 9
  212.000000 113.000000 2
  213.000000 18.000000 1
  214.000000 97.000000 2
  216.000000 16.000000 1
  218.000000 19.000000 1
  219.000000 132.000000 2
  220.000000 90.000000 2
  222.000000 5.000000 1
  223.000000 3.000000 1
  224.000000 151.000000 3
  226.000000 30.000000 1
  227.000000 70.000000 1
  228.000000 47.000000 1
  229.000000 47.000000 1
  230.000000 31.000000 1
  232.000000 41.000000 1
  233.000000 30.000000 1
  234.000000 19.000000 1
  235.000000 76.000000 1
  236.000000 27.000000 1
  237.000000 86.000000 2
  238.000000 46.000000 1
  240.000000 21.000000 1
  242.000000 44.000000 1
  243.000000 113.000000 2
  244.000000 29.000000 1
  246.000000 31.000000 1
  247.000000 34.000000 1
  248.000000 62.000000 1
  249.000000 30.000000 1
  250.000000 2.000000 1
  251.000000 10.000000 1
  252.000000 29.000000 1
  253.000000 263.000000 5
  254.000000 142.000000 3
  255.000000 34.000000 1
  256.000000 30.000000 1
  257.000000 89.000000 2
  258.000000 119.000000 2
  261.000000 10.000000 1
  262.000000 13.000000 1
  263.000000 8.000000 1
  264.000000 140.000000 3
  265.000000 46.000000 1
  266.000000 11.000000 1
  267.000000 33.000000 1
  268.000000 70.000000 1
  269.000000 86.000000 2
  272.000000 5.000000 1
  273.000000 13.000000 1
  274.000000 5.000000 1
  275.000000 21.000000 1
  277.000000 26.000000 1
  278.000000 47.000000 1
  279.000000 121.000000 2
  280.000000 111.000000 2
  282.000000 70.000000 1
  283.000000 24.000000 1
  285.000000 39.000000 1
  286.000000 10.000000 1
  291.000000 60.000000 1
  292.000000 29.000000 1
  293.000000 39.000000 1
  294.000000 84.000000 2
  295.000000 41.000000 1
  296.000000 62.000000 1
  298.000000 66.000000 1
  299.000000 55.000000 1
  300.000000 76.000000 1
  301.000000 39.000000 1
  303.000000 19.000000 1
  304.000000 26.000000 1
  305.000000 78.000000 1
  306.000000 49.000000 1
  307.000000 65.000000 1
  308.000000 34.000000 1
  309.000000 41.000000 1
  311.000000 5.000000 1
  312.000000 21.000000 1
  313.000000 29.000000 1
  314.000000 122.000000 2
  315.000000 92.000000 2
  316.000000 11.000000 1
  317.000000 34.000000 1
  318.000000 27.000000 1
  319.000000 2.000000 1
  321.000000 46.000000 1
  323.000000 44.000000 1
  325.000000 44.000000 1
  326.000000 90.000000 2
  327.000000 110.000000 2
  328.000000 79.000000 1
  329.000000 63.000000 1
  330.000000 106.000000 2
  331.000000 162.000000 3
  332.000000 39.000000 1
  333.000000 60.000000 1
  334.000000 84.000000 2
  336.000000 3.000000 1
  338.000000 21.000000 1
  339.000000 29.000000 1
  341.000000 62.000000 1
  342.000000 54.000000 1
  344.000000 50.000000 1
  346.000000 52.000000 1
  347.000000 24.000000 1
  348.000000 47.000000 1
  349.000000 36.000000 1
  350.000000 6.000000 1
  351.000000 58.000000 1
  352.000000 119.000000 2
  353.000000 19.000000 1
  354.000000 44.000000 1
  355.000000 27.000000 1
  357.000000 11.000000 1
  358.000000 70.000000 1
  359.000000 70.000000 1
  360.000000 71.000000 1
  361.000000 97.000000 2
  362.000000 13.000000 1
  363.000000 94.000000 2
  364.000000 2.000000 1
  365.000000 68.000000 1
  366.000000 16.000000 1
  367.000000 30.000000 1
  369.000000 31.000000 1
  370.000000 10.000000 1
  371.000000 111.000000 2
  372.000000 41.000000 1
  374.000000 68.000000 1
  375.000000 52.000000 1
  377.000000 10.000000 1
  378.000000 102.000000 2
  379.000000 36.000000 1
  380.000000 74.000000 1
  381.000000 29.000000 1
  382.000000 70.000000 1
  384.000000 90.000000 2
  386.000000 86.000000 2
  387.000000 8.000000 1
  388.000000 98.000000 2
  389.000000 116.000000 2
  391.000000 84.000000 2
  392.000000 62.000000 1
  393.000000 89.000000 2
  394.000000 63.000000 1
  395.000000 6.000000 1
  396.000000 82.000000 2
  397.000000 49.000000 1
  399.000000 10.000000 1
  401.000000 55.000000 1
  402.000000 24.000000 1
  403.000000 92.000000 2
  404.000000 26.000000 1
  405.000000 130.000000 2
  406.000000 52.000000 1
  408.000000 89.000000 2
  409.000000 29.000000 1
  410.000000 66.000000 1
  411.000000 19.000000 1
  412.000000 5.000000 1
  413.000000 65.000000 1
  414.000000 49.000000 1
  415.000000 14.000000 1
  416.000000 29.000000 1
  417.000000 13.000000 1
  418.000000 10.000000 1
  419.000000 24.000000 1
  420.000000 14.000000 1
  422.000000 31.000000 1
  423.000000 95.000000 2
  425.000000 36.000000 1
  426.000000 21.000000 1
  428.000000 6.000000 1
  429.000000 30.000000 1
  430.000000 19.000000 1
  431.000000 21.000000 1
  433.000000 63.000000 1
  436.000000 41.000000 1
  437.000000 49.000000 1
  438.000000 119.000000 2
  439.000000 6.000000 1
  441.000000 116.000000 2
  442.000000 49.000000 1
  443.000000 94.000000 2
  446.000000 34.000000 1
  447.000000 73.000000 1
  449.000000 84.000000 2
  452.000000 84.000000 2
  453.000000 6.000000 1
  456.000000 63.000000 1
  457.000000 26.000000 1
  458.000000 113.000000 2
  459.000000 44.000000 1
  460.000000 78.000000 1
  461.000000 50.000000 1
  462.000000 26.000000 1
  463.000000 26.000000 1
  464.000000 90.000000 2
  465.000000 13.000000 1
  466.000000 33.000000 1
  467.000000 54.000000 1
  468.000000 47.000000 1
  471.000000 22.000000 1
  472.000000 44.000000 1
  473.000000 38.000000 1
  474.000000 74.000000 1
  476.000000 38.000000 1
  477.000000 66.000000 1
  478.000000 22.000000 1
  479.000000 98.000000 2
  480.000000 114.000000 2
  481.000000 22.000000 1
  482.000000 57.000000 1
  483.000000 41.000000 1
  484.000000 19.000000 1
  485.000000 158.000000 3
  486.000000 42.000000 1
  488.000000 11.000000 1
  489.000000 39.000000 1
  490.000000 68.000000 1
  491.000000 14.000000 1
  493.000000 50.000000 1
  494.000000 65.000000 1
  495.000000 29.000000 1
  496.000000 92.000000 2
  497.000000 87.000000 2
  498.000000 11.000000 1
  499.000000 79.000000 1