ACCESSION: MSBNK-GL_Sciences_Inc-GLS00163
RECORD_TITLE: 1,6-Anhydro-beta-D-Glucose; EI-B; MS; 3 TMS; RT: 694.88 s
DATE: 2016.01.19 (Created 2012.08.03, modified 2013.07.31)
AUTHORS: Miyagawa H, Akimoto S, Yamasaki K, GL Sciences Inc.
LICENSE: CC BY-SA
COPYRIGHT: GLS
COMMENT: The chemical compound was chemically modified with N-methyl-N-trimethylsilyl-trifluoroacetamide(MSTFA) before GC-MS analysis. When it has two or more functional groups, this modification gave a mixture of the TMS derivatives having different number of TMS groups at different functional groups.

CH$NAME: 1,6-Anhydro-beta-D-Glucose
CH$NAME: 1,6-Anhydro-b-D-Glucose
CH$NAME: Levoglucosan
CH$COMPOUND_CLASS: Natural Product
CH$FORMULA: C6H10O5
CH$EXACT_MASS: 162.05282
CH$SMILES: C1[C@@H]2[C@H]([C@@H]([C@H]([C@H](O1)O2)O)O)O
CH$IUPAC: InChI=1S/C6H10O5/c7-3-2-1-10-6(11-2)5(9)4(3)8/h2-9H,1H2/t2-,3-,4+,5-,6-/m1/s1
CH$LINK: CAS 498-07-7
CH$LINK: INCHIKEY TWNIBLMWSKIRAT-VFUOTHLCSA-N
CH$LINK: COMPTOX DTXSID90904321
CH$LINK: PUBCHEM CID:2724705

AC$INSTRUMENT: GCMS-2010 Plus, Shimadzu
AC$INSTRUMENT_TYPE: EI-B
AC$MASS_SPECTROMETRY: MS_TYPE MS
AC$MASS_SPECTROMETRY: ION_MODE POSITIVE
AC$MASS_SPECTROMETRY: GAS_PRESSURE 75 kPa
AC$MASS_SPECTROMETRY: ION_SOURCE_TEMPERATURE 200 C
AC$MASS_SPECTROMETRY: SCAN_RANGE_M/Z 85-500
AC$CHROMATOGRAPHY: COLUMN_NAME InertCap 5MS/NP 0.25 mmI.D. x 30 m, df=0.25 um
AC$CHROMATOGRAPHY: INJECTION_TEMPERATURE 230 C
AC$CHROMATOGRAPHY: OVEN_TEMPERATURE 80 C(2 min)-15 C/min - 330C
AC$CHROMATOGRAPHY: RETENTION_INDEX 1726
AC$CHROMATOGRAPHY: RETENTION_TIME 694.88
AC$CHROMATOGRAPHY: TRANSFARLINE_TEMPERATURE 250 C

MS$FOCUSED_ION: DERIVATIVE_TYPE 3 TMS
MS$DATA_PROCESSING: WHOLE GCMSsolution

PK$SPLASH: splash10-0uxr-0891000000-57d1cb031374b05f81ee
PK$NUM_PEAK: 376
PK$PEAK: m/z int. rel.int.
  86.000000 1121.000000 2
  87.000000 4948.000000 9
  87.950000 1483.000000 3
  88.950000 7091.000000 13
  90.000000 543.000000 1
  91.000000 929.000000 2
  92.000000 164.000000 1
  93.000000 290.000000 1
  94.000000 697.000000 1
  95.000000 1018.000000 2
  96.000000 838.000000 2
  97.000000 3721.000000 7
  97.950000 1616.000000 3
  98.950000 8693.000000 16
  100.050000 1252.000000 2
  101.000000 34729.000000 65
  101.950000 4841.000000 9
  103.000000 95638.000000 178
  104.000000 9127.000000 17
  104.950000 6525.000000 12
  106.000000 551.000000 1
  107.000000 404.000000 1
  108.000000 87.000000 1
  108.950000 6025.000000 11
  110.000000 438.000000 1
  111.000000 5230.000000 10
  112.050000 1176.000000 2
  112.950000 15519.000000 29
  114.000000 2294.000000 4
  114.950000 9948.000000 18
  116.000000 23329.000000 43
  117.000000 50878.000000 95
  118.000000 5721.000000 11
  118.950000 7802.000000 14
  120.000000 900.000000 2
  121.000000 532.000000 1
  122.000000 108.000000 1
  123.000000 268.000000 1
  124.000000 426.000000 1
  124.950000 1499.000000 3
  126.000000 1007.000000 2
  127.000000 7714.000000 14
  128.050000 2251.000000 4
  129.000000 122946.000000 228
  130.000000 14929.000000 28
  130.950000 30472.000000 57
  132.000000 4506.000000 8
  132.950000 59990.000000 111
  134.000000 8001.000000 15
  134.950000 6340.000000 12
  135.900000 500.000000 1
  136.950000 1146.000000 2
  138.000000 226.000000 1
  139.000000 1137.000000 2
  140.000000 484.000000 1
  141.000000 2719.000000 5
  142.000000 22591.000000 42
  142.950000 49911.000000 93
  143.950000 6634.000000 12
  145.000000 8399.000000 16
  146.050000 1968.000000 4
  147.000000 192873.000000 358
  148.000000 31879.000000 59
  149.000000 26305.000000 49
  150.000000 3134.000000 6
  150.950000 2075.000000 4
  152.000000 5103.000000 9
  153.000000 2926.000000 5
  154.050000 1029.000000 2
  154.950000 22260.000000 41
  156.000000 3222.000000 6
  156.950000 9393.000000 17
  158.000000 1220.000000 2
  158.950000 8260.000000 15
  160.050000 1290.000000 2
  161.000000 26426.000000 49
  162.000000 3369.000000 6
  162.950000 7984.000000 15
  164.000000 1041.000000 2
  165.000000 649.000000 1
  166.000000 174.000000 1
  167.000000 321.000000 1
  168.000000 1252.000000 2
  168.950000 9063.000000 17
  170.000000 6327.000000 12
  170.950000 26240.000000 49
  171.950000 3899.000000 7
  172.950000 3517.000000 7
  173.950000 3051.000000 6
  174.900000 3660.000000 7
  175.850000 786.000000 1
  176.900000 10826.000000 20
  177.950000 2017.000000 4
  178.900000 942.000000 2
  179.900000 212.000000 1
  180.900000 468.000000 1
  181.900000 161.000000 1
  182.900000 8295.000000 15
  183.900000 1151.000000 2
  184.900000 1305.000000 2
  185.900000 409.000000 1
  186.950000 2188.000000 4
  187.950000 1220.000000 2
  188.900000 132569.000000 246
  189.900000 26554.000000 49
  190.900000 115473.000000 215
  191.900000 20502.000000 38
  192.900000 9694.000000 18
  193.900000 1068.000000 2
  194.900000 404.000000 1
  195.900000 153.000000 1
  196.900000 143.000000 1
  197.900000 521.000000 1
  198.900000 4601.000000 9
  199.950000 991.000000 2
  200.900000 2004.000000 4
  201.900000 337.000000 1
  202.950000 9241.000000 17
  203.900000 537649.000000 999
  204.900000 106513.000000 198
  205.900000 44471.000000 83
  206.900000 7414.000000 14
  207.900000 1414.000000 3
  208.900000 396.000000 1
  209.900000 206.000000 1
  210.900000 151.000000 1
  211.900000 60.000000 1
  212.900000 382.000000 1
  213.900000 367.000000 1
  214.900000 5922.000000 11
  215.950000 4194.000000 8
  216.900000 518471.000000 963
  217.900000 104614.000000 194
  218.900000 46913.000000 87
  219.900000 6534.000000 12
  220.900000 5916.000000 11
  221.950000 1309.000000 2
  223.000000 834.000000 2
  224.000000 90.000000 1
  225.000000 287.000000 1
  226.000000 76.000000 1
  226.900000 1121.000000 2
  227.900000 242.000000 1
  228.900000 2177.000000 4
  229.950000 3087.000000 6
  230.900000 8090.000000 15
  231.950000 2366.000000 4
  232.900000 2044.000000 4
  233.900000 471.000000 1
  234.900000 246.000000 1
  235.900000 70.000000 1
  236.900000 87.000000 1
  237.900000 137.000000 1
  238.900000 342.000000 1
  239.900000 127.000000 1
  240.950000 1772.000000 3
  241.950000 4530.000000 8
  242.950000 39327.000000 73
  243.950000 9827.000000 18
  244.900000 12814.000000 24
  245.900000 3378.000000 6
  246.900000 1746.000000 3
  247.900000 218.000000 1
  248.900000 1042.000000 2
  249.900000 198.000000 1
  250.900000 26.000000 1
  251.900000 74.000000 1
  252.900000 89.000000 1
  253.900000 66.000000 1
  254.900000 732.000000 1
  255.900000 156.000000 1
  256.900000 1586.000000 3
  257.900000 487.000000 1
  258.900000 3914.000000 7
  259.900000 12036.000000 22
  260.900000 6783.000000 13
  261.900000 2201.000000 4
  262.900000 591.000000 1
  263.900000 383.000000 1
  264.900000 1489.000000 3
  265.900000 327.000000 1
  266.900000 226.000000 1
  267.900000 110.000000 1
  268.900000 34.000000 1
  269.900000 42.000000 1
  270.900000 1162.000000 2
  271.900000 375.000000 1
  272.900000 7132.000000 13
  273.900000 1636.000000 3
  274.900000 1266.000000 2
  275.900000 239.000000 1
  276.900000 271.000000 1
  277.900000 145.000000 1
  278.900000 94.000000 1
  279.900000 57.000000 1
  280.900000 106.000000 1
  281.900000 34.000000 1
  282.900000 103.000000 1
  283.900000 151.000000 1
  285.900000 41.000000 1
  286.900000 65.000000 1
  287.900000 746.000000 1
  288.900000 545.000000 1
  289.900000 385.000000 1
  290.900000 750.000000 1
  291.900000 543.000000 1
  292.900000 191.000000 1
  293.900000 161.000000 1
  294.900000 11.000000 1
  295.900000 52.000000 1
  296.900000 34.000000 1
  297.900000 3.000000 1
  298.900000 87.000000 1
  299.900000 103.000000 1
  301.900000 34.000000 1
  302.900000 626.000000 1
  303.900000 2791.000000 5
  304.950000 4867.000000 9
  305.950000 1868.000000 3
  306.900000 990.000000 2
  307.900000 145.000000 1
  308.900000 153.000000 1
  309.900000 103.000000 1
  310.900000 10.000000 1
  312.900000 57.000000 1
  314.900000 156.000000 1
  315.900000 113.000000 1
  316.950000 12780.000000 24
  317.900000 3431.000000 6
  318.900000 2527.000000 5
  319.900000 516.000000 1
  320.900000 148.000000 1
  321.900000 29.000000 1
  322.900000 14.000000 1
  324.900000 39.000000 1
  325.900000 39.000000 1
  326.900000 3.000000 1
  327.900000 86.000000 1
  328.900000 145.000000 1
  329.900000 24.000000 1
  330.900000 1538.000000 3
  331.950000 7822.000000 15
  332.900000 122746.000000 228
  333.900000 40583.000000 75
  334.900000 18094.000000 34
  335.900000 3838.000000 7
  336.900000 934.000000 2
  337.900000 169.000000 1
  338.900000 30.000000 1
  340.900000 5.000000 1
  341.900000 27.000000 1
  342.900000 29.000000 1
  343.900000 119.000000 1
  344.900000 402.000000 1
  345.900000 86.000000 1
  346.900000 154.000000 1
  347.900000 49.000000 1
  348.900000 834.000000 2
  349.900000 420.000000 1
  350.900000 314.000000 1
  351.900000 97.000000 1
  352.900000 16.000000 1
  353.900000 82.000000 1
  354.900000 38.000000 1
  357.900000 33.000000 1
  358.900000 55.000000 1
  359.900000 34.000000 1
  360.900000 190.000000 1
  361.900000 212.000000 1
  362.900000 1084.000000 2
  363.900000 239.000000 1
  364.900000 204.000000 1
  365.900000 62.000000 1
  366.900000 89.000000 1
  367.900000 57.000000 1
  368.900000 58.000000 1
  369.900000 84.000000 1
  370.900000 38.000000 1
  371.900000 24.000000 1
  372.900000 82.000000 1
  374.900000 19.000000 1
  375.900000 30.000000 1
  376.900000 63.000000 1
  377.900000 340.000000 1
  378.900000 153.000000 1
  379.900000 234.000000 1
  380.900000 34.000000 1
  381.900000 6.000000 1
  382.900000 27.000000 1
  383.900000 60.000000 1
  384.900000 132.000000 1
  385.900000 158.000000 1
  386.900000 39.000000 1
  387.900000 60.000000 1
  388.900000 71.000000 1
  389.900000 116.000000 1
  390.900000 57.000000 1
  391.900000 65.000000 1
  392.900000 11.000000 1
  393.900000 39.000000 1
  394.900000 90.000000 1
  396.900000 127.000000 1
  397.900000 90.000000 1
  398.900000 2.000000 1
  399.900000 24.000000 1
  401.900000 66.000000 1
  402.900000 89.000000 1
  404.900000 76.000000 1
  406.900000 30.000000 1
  408.900000 29.000000 1
  412.900000 60.000000 1
  413.900000 49.000000 1
  415.900000 50.000000 1
  417.900000 103.000000 1
  418.900000 102.000000 1
  419.900000 54.000000 1
  421.900000 49.000000 1
  422.900000 82.000000 1
  425.900000 71.000000 1
  426.900000 108.000000 1
  427.900000 71.000000 1
  429.900000 46.000000 1
  430.900000 71.000000 1
  431.900000 54.000000 1
  432.900000 81.000000 1
  433.900000 121.000000 1
  434.900000 84.000000 1
  435.900000 68.000000 1
  437.900000 122.000000 1
  438.900000 34.000000 1
  439.900000 71.000000 1
  440.900000 63.000000 1
  442.900000 86.000000 1
  443.900000 46.000000 1
  444.900000 138.000000 1
  445.900000 44.000000 1
  446.900000 86.000000 1
  447.900000 58.000000 1
  449.900000 97.000000 1
  451.900000 49.000000 1
  452.900000 31.000000 1
  453.900000 65.000000 1
  456.900000 55.000000 1
  457.900000 87.000000 1
  458.900000 58.000000 1
  461.900000 29.000000 1
  462.900000 19.000000 1
  463.900000 87.000000 1
  464.900000 135.000000 1
  465.900000 41.000000 1
  466.900000 74.000000 1
  467.900000 97.000000 1
  468.900000 27.000000 1
  469.900000 65.000000 1
  470.900000 100.000000 1
  471.900000 49.000000 1
  472.900000 36.000000 1
  473.900000 29.000000 1
  474.900000 34.000000 1
  475.900000 60.000000 1
  476.900000 52.000000 1
  477.900000 119.000000 1
  478.900000 71.000000 1
  479.900000 62.000000 1
  480.900000 2.000000 1
  482.900000 57.000000 1
  483.900000 79.000000 1
  484.900000 65.000000 1
  485.900000 79.000000 1
  486.900000 146.000000 1
  487.900000 22.000000 1
  488.900000 36.000000 1
  491.900000 41.000000 1
  492.900000 66.000000 1
  493.900000 42.000000 1
  496.900000 90.000000 1