ACCESSION: MSBNK-GL_Sciences_Inc-GLS00172
RECORD_TITLE: D-Arabitol; EI-B; MS; 5 TMS; RT: 704.48 s
DATE: 2016.01.19 (Created 2012.08.03, modified 2013.07.31)
AUTHORS: Miyagawa H, Akimoto S, Yamasaki K, GL Sciences Inc.
LICENSE: CC BY-SA
COPYRIGHT: GLS
COMMENT: The chemical compound was chemically modified with N-methyl-N-trimethylsilyl-trifluoroacetamide(MSTFA) before GC-MS analysis. When it has two or more functional groups, this modification gave a mixture of the TMS derivatives having different number of TMS groups at different functional groups.

CH$NAME: D-Arabitol
CH$COMPOUND_CLASS: Natural Product
CH$FORMULA: C5H12O5
CH$EXACT_MASS: 152.06847
CH$SMILES: C([C@H](C([C@@H](CO)O)O)O)O
CH$IUPAC: InChI=1S/C5H12O5/c6-1-3(8)5(10)4(9)2-7/h3-10H,1-2H2/t3-,4-/m1/s1
CH$LINK: CAS 488-82-4
CH$LINK: CHEBI 18333
CH$LINK: KEGG C01904
CH$LINK: INCHIKEY HEBKCHPVOIAQTA-QWWZWVQMSA-N
CH$LINK: COMPTOX DTXSID4045979
CH$LINK: PUBCHEM CID:94154

AC$INSTRUMENT: GCMS-2010 Plus, Shimadzu
AC$INSTRUMENT_TYPE: EI-B
AC$MASS_SPECTROMETRY: MS_TYPE MS
AC$MASS_SPECTROMETRY: ION_MODE POSITIVE
AC$MASS_SPECTROMETRY: GAS_PRESSURE 75 kPa
AC$MASS_SPECTROMETRY: ION_SOURCE_TEMPERATURE 200 C
AC$MASS_SPECTROMETRY: SCAN_RANGE_M/Z 85-500
AC$CHROMATOGRAPHY: COLUMN_NAME InertCap 5MS/NP 0.25 mmI.D. x 30 m, df=0.25 um
AC$CHROMATOGRAPHY: INJECTION_TEMPERATURE 230 C
AC$CHROMATOGRAPHY: OVEN_TEMPERATURE 80 C(2 min)-15 C/min - 330C
AC$CHROMATOGRAPHY: RETENTION_INDEX 1746
AC$CHROMATOGRAPHY: RETENTION_TIME 704.48
AC$CHROMATOGRAPHY: TRANSFARLINE_TEMPERATURE 250 C

MS$FOCUSED_ION: DERIVATIVE_TYPE 5 TMS
MS$DATA_PROCESSING: WHOLE GCMSsolution

PK$SPLASH: splash10-0gb9-0893000000-1cc7e3d450b62ff4050a
PK$NUM_PEAK: 379
PK$PEAK: m/z int. rel.int.
  86.000000 698.000000 1
  87.000000 6951.000000 6
  87.950000 4813.000000 4
  89.000000 27276.000000 22
  89.950000 2747.000000 2
  90.950000 1141.000000 1
  92.000000 74.000000 1
  93.000000 138.000000 1
  94.000000 158.000000 1
  95.000000 279.000000 1
  96.000000 356.000000 1
  97.000000 1814.000000 1
  97.900000 465.000000 1
  98.950000 2614.000000 2
  100.000000 518.000000 1
  100.950000 24031.000000 19
  102.050000 6388.000000 5
  103.000000 693726.000000 558
  104.000000 62748.000000 50
  105.000000 26482.000000 21
  106.000000 1638.000000 1
  107.000000 201.000000 1
  108.000000 60.000000 1
  109.000000 239.000000 1
  110.000000 124.000000 1
  110.950000 2083.000000 2
  112.000000 570.000000 1
  112.950000 7865.000000 6
  114.000000 927.000000 1
  114.950000 5493.000000 4
  116.000000 23793.000000 19
  117.000000 155398.000000 125
  117.950000 16383.000000 13
  118.900000 10905.000000 9
  119.900000 1055.000000 1
  120.900000 650.000000 1
  121.900000 62.000000 1
  122.900000 138.000000 1
  123.900000 140.000000 1
  124.900000 543.000000 1
  125.950000 1017.000000 1
  126.900000 2903.000000 2
  128.050000 1997.000000 2
  128.950000 326999.000000 263
  130.000000 37842.000000 30
  130.950000 42697.000000 34
  131.950000 5957.000000 5
  132.950000 86753.000000 70
  133.950000 11635.000000 9
  134.900000 7604.000000 6
  135.900000 737.000000 1
  136.900000 346.000000 1
  137.900000 82.000000 1
  138.900000 234.000000 1
  139.900000 206.000000 1
  141.000000 1556.000000 1
  141.950000 2631.000000 2
  142.950000 15607.000000 13
  143.950000 1877.000000 2
  144.950000 8441.000000 7
  146.050000 4246.000000 3
  146.950000 570220.000000 459
  147.950000 92204.000000 74
  148.950000 54505.000000 44
  149.950000 5852.000000 5
  150.900000 2786.000000 2
  152.050000 834.000000 1
  153.000000 3322.000000 3
  154.000000 692.000000 1
  154.950000 8273.000000 7
  156.050000 1715.000000 1
  156.950000 53116.000000 43
  158.000000 6513.000000 5
  158.950000 5897.000000 5
  160.000000 1113.000000 1
  161.000000 6474.000000 5
  161.950000 1344.000000 1
  162.950000 10272.000000 8
  164.000000 1468.000000 1
  165.000000 852.000000 1
  166.000000 102.000000 1
  167.000000 135.000000 1
  168.000000 239.000000 1
  168.950000 2294.000000 2
  169.900000 4079.000000 3
  170.950000 6430.000000 5
  171.950000 1241.000000 1
  173.000000 1778.000000 1
  173.950000 1018.000000 1
  174.900000 13825.000000 11
  175.900000 2850.000000 2
  176.900000 11270.000000 9
  177.900000 1889.000000 2
  178.900000 873.000000 1
  179.900000 70.000000 1
  180.900000 13.000000 1
  181.900000 49.000000 1
  182.900000 66.000000 1
  184.900000 694.000000 1
  185.900000 143.000000 1
  186.900000 911.000000 1
  187.950000 1002.000000 1
  188.850000 120528.000000 97
  189.900000 27822.000000 22
  190.900000 110324.000000 89
  191.900000 19266.000000 15
  192.900000 8657.000000 7
  193.900000 1143.000000 1
  194.900000 414.000000 1
  195.900000 57.000000 1
  196.900000 126.000000 1
  197.900000 6.000000 1
  198.900000 153.000000 1
  199.900000 89.000000 1
  200.900000 3673.000000 3
  201.950000 1801.000000 1
  202.900000 66295.000000 53
  203.900000 168642.000000 136
  204.900000 434980.000000 350
  205.900000 87426.000000 70
  206.900000 41225.000000 33
  207.850000 5530.000000 4
  208.850000 1597.000000 1
  209.900000 460.000000 1
  210.900000 92.000000 1
  211.900000 21.000000 1
  212.900000 183.000000 1
  213.900000 70.000000 1
  214.900000 2953.000000 2
  215.950000 8739.000000 7
  216.900000 1242233.000000 999
  217.900000 299729.000000 241
  218.900000 124468.000000 100
  219.900000 19106.000000 15
  220.850000 22705.000000 18
  221.850000 4758.000000 4
  222.850000 2464.000000 2
  223.900000 502.000000 1
  224.900000 287.000000 1
  225.900000 201.000000 1
  226.900000 628.000000 1
  227.900000 322.000000 1
  228.900000 26314.000000 21
  229.900000 6017.000000 5
  230.900000 4919.000000 4
  231.900000 1034.000000 1
  232.900000 457.000000 1
  233.900000 122.000000 1
  234.900000 266.000000 1
  235.900000 42.000000 1
  236.850000 976.000000 1
  237.800000 82.000000 1
  238.800000 76.000000 1
  239.800000 58.000000 1
  240.900000 529.000000 1
  241.950000 4441.000000 4
  242.900000 93519.000000 75
  243.900000 21279.000000 17
  244.850000 11460.000000 9
  245.850000 1533.000000 1
  246.900000 2350.000000 2
  247.900000 572.000000 1
  248.900000 430.000000 1
  249.900000 143.000000 1
  250.900000 52.000000 1
  252.900000 79.000000 1
  255.900000 34.000000 1
  256.900000 71.000000 1
  257.900000 90.000000 1
  258.900000 462.000000 1
  259.900000 295.000000 1
  260.900000 153.000000 1
  261.900000 62.000000 1
  262.900000 682.000000 1
  263.900000 290.000000 1
  264.900000 2188.000000 2
  265.900000 722.000000 1
  266.900000 335.000000 1
  267.900000 41.000000 1
  268.900000 127.000000 1
  269.900000 82.000000 1
  270.900000 137.000000 1
  271.900000 78.000000 1
  272.900000 8.000000 1
  273.900000 63.000000 1
  274.900000 180.000000 1
  275.900000 282.000000 1
  276.900000 84159.000000 68
  277.900000 24268.000000 20
  278.950000 14156.000000 11
  279.900000 2823.000000 2
  280.900000 905.000000 1
  281.900000 154.000000 1
  282.900000 54.000000 1
  284.900000 63.000000 1
  285.900000 55.000000 1
  286.900000 49.000000 1
  287.900000 124.000000 1
  288.900000 130.000000 1
  289.900000 498.000000 1
  290.850000 16310.000000 13
  291.800000 4783.000000 4
  292.900000 3178.000000 3
  293.900000 825.000000 1
  294.900000 260.000000 1
  295.900000 162.000000 1
  296.900000 24.000000 1
  300.900000 62.000000 1
  301.900000 16.000000 1
  302.900000 1124.000000 1
  303.900000 330.000000 1
  304.950000 8069.000000 6
  305.950000 26027.000000 21
  306.900000 330962.000000 266
  307.900000 98572.000000 79
  308.900000 48358.000000 39
  309.850000 10183.000000 8
  310.850000 2019.000000 2
  311.900000 273.000000 1
  312.900000 103.000000 1
  313.900000 126.000000 1
  315.900000 153.000000 1
  316.900000 34991.000000 28
  317.950000 14646.000000 12
  318.900000 296284.000000 238
  319.900000 82950.000000 67
  320.900000 40654.000000 33
  321.900000 8287.000000 7
  322.900000 2311.000000 2
  323.900000 306.000000 1
  324.900000 214.000000 1
  325.900000 29.000000 1
  326.900000 81.000000 1
  327.900000 27.000000 1
  328.900000 11.000000 1
  329.900000 108.000000 1
  330.950000 2156.000000 2
  331.900000 46273.000000 37
  332.900000 16969.000000 14
  333.850000 7829.000000 6
  334.850000 2393.000000 2
  335.900000 370.000000 1
  336.900000 154.000000 1
  338.900000 39.000000 1
  340.900000 71.000000 1
  342.900000 70.000000 1
  343.900000 18.000000 1
  344.900000 82.000000 1
  345.900000 13.000000 1
  346.900000 13.000000 1
  347.900000 55.000000 1
  348.900000 87.000000 1
  349.900000 132.000000 1
  350.900000 770.000000 1
  351.900000 287.000000 1
  352.900000 196.000000 1
  353.900000 71.000000 1
  354.900000 21.000000 1
  355.900000 62.000000 1
  356.900000 57.000000 1
  357.900000 81.000000 1
  358.900000 79.000000 1
  359.900000 19.000000 1
  360.900000 89.000000 1
  361.900000 44.000000 1
  362.900000 92.000000 1
  363.900000 31.000000 1
  364.900000 87.000000 1
  365.900000 105.000000 1
  366.900000 39.000000 1
  367.900000 30.000000 1
  368.900000 11.000000 1
  369.900000 24.000000 1
  370.900000 11.000000 1
  371.900000 2.000000 1
  372.900000 50.000000 1
  373.900000 50.000000 1
  374.900000 150.000000 1
  375.900000 38.000000 1
  376.900000 146.000000 1
  377.900000 46.000000 1
  378.900000 113.000000 1
  379.900000 102.000000 1
  380.900000 87.000000 1
  381.900000 113.000000 1
  383.900000 49.000000 1
  385.900000 55.000000 1
  388.900000 18.000000 1
  390.900000 50.000000 1
  391.900000 10.000000 1
  393.900000 401.000000 1
  394.850000 14423.000000 12
  395.850000 5560.000000 4
  396.800000 3086.000000 2
  397.800000 727.000000 1
  398.800000 431.000000 1
  399.800000 108.000000 1
  402.800000 127.000000 1
  403.800000 8.000000 1
  404.800000 105.000000 1
  405.800000 100.000000 1
  406.750000 3085.000000 2
  407.850000 1654.000000 1
  408.800000 2606.000000 2
  409.800000 863.000000 1
  410.800000 431.000000 1
  411.800000 172.000000 1
  412.800000 29.000000 1
  413.800000 113.000000 1
  414.800000 97.000000 1
  416.800000 57.000000 1
  418.800000 47.000000 1
  419.800000 27.000000 1
  420.900000 158.000000 1
  421.850000 11318.000000 9
  422.850000 4745.000000 4
  423.800000 2180.000000 2
  424.800000 662.000000 1
  425.800000 284.000000 1
  426.800000 27.000000 1
  427.800000 110.000000 1
  428.800000 103.000000 1
  429.800000 27.000000 1
  430.800000 124.000000 1
  431.800000 13.000000 1
  432.800000 66.000000 1
  433.800000 6.000000 1
  435.800000 3.000000 1
  436.800000 27.000000 1
  437.800000 55.000000 1
  439.800000 8.000000 1
  440.800000 57.000000 1
  441.800000 46.000000 1
  442.800000 33.000000 1
  445.800000 19.000000 1
  446.800000 5.000000 1
  448.800000 33.000000 1
  449.800000 47.000000 1
  450.800000 21.000000 1
  451.800000 30.000000 1
  452.800000 79.000000 1
  453.800000 13.000000 1
  454.800000 84.000000 1
  455.800000 11.000000 1
  456.800000 42.000000 1
  457.800000 46.000000 1
  458.800000 55.000000 1
  459.800000 73.000000 1
  460.800000 34.000000 1
  461.800000 2.000000 1
  462.800000 39.000000 1
  463.800000 55.000000 1
  466.800000 71.000000 1
  467.800000 60.000000 1
  468.800000 124.000000 1
  469.800000 39.000000 1
  470.800000 14.000000 1
  471.800000 71.000000 1
  472.800000 46.000000 1
  473.800000 2.000000 1
  475.800000 33.000000 1
  476.800000 81.000000 1
  477.800000 82.000000 1
  478.800000 84.000000 1
  479.800000 62.000000 1
  482.800000 84.000000 1
  483.800000 60.000000 1
  484.800000 24.000000 1
  485.800000 2.000000 1
  486.800000 27.000000 1
  488.800000 31.000000 1
  489.800000 26.000000 1
  490.800000 31.000000 1
  492.800000 13.000000 1
  493.800000 19.000000 1
  495.800000 5.000000 1
  496.800000 81.000000 1
  497.800000 114.000000 1
  498.800000 73.000000 1