ACCESSION: MSBNK-Kazusa-KZ000183
RECORD_TITLE: alpha-Methyl-DL-serine; GC-EI-TOF; MS; 3 TMS; BP:114
DATE: 2016.01.19 (Created 2009.03.11, modified 2011.05.06)
AUTHORS: Ara T, Morishita Y, Shibata D, Kazusa DNA Research Institute
LICENSE: CC BY-SA
COMMENT: MassBase peak ID: MDGC1_01701_P000029

CH$NAME: alpha-Methyl-DL-serine
CH$COMPOUND_CLASS: Natural Product
CH$FORMULA: C4H9NO3
CH$EXACT_MASS: 119.05824
CH$SMILES: OC[C@@](C)(N)C(O)=O
CH$IUPAC: InChI=1S/C4H9NO3/c1-4(5,2-6)3(7)8/h6H,2,5H2,1H3,(H,7,8)/t4-/m1/s1
CH$LINK: CAS 5424-29-3
CH$LINK: KEGG C02115
CH$LINK: INCHIKEY CDUUKBXTEOFITR-SCSAIBSYSA-N
CH$LINK: COMPTOX DTXSID60331428

AC$INSTRUMENT: Pegasus III TOF-MS system, Leco; GC 6890, Agilent Technologies
AC$INSTRUMENT_TYPE: GC-EI-TOF
AC$MASS_SPECTROMETRY: MS_TYPE MS
AC$MASS_SPECTROMETRY: ION_MODE POSITIVE
AC$CHROMATOGRAPHY: COLUMN_NAME DB-17MS
AC$CHROMATOGRAPHY: RETENTION_INDEX 1384.9
AC$CHROMATOGRAPHY: RETENTION_TIME 624.063 sec

MS$FOCUSED_ION: BASE_PEAK 114
MS$FOCUSED_ION: DERIVATIVE_TYPE 3 TMS
MS$DATA_PROCESSING: WHOLE ChromaTOF ver. 2.32 (Leco)

PK$SPLASH: splash10-02ai-1963200000-e7598a3d8394f97a7c1c
PK$NUM_PEAK: 419
PK$PEAK: m/z int. rel.int.
  82 48 48
  83 47 47
  84 112 112
  85 71 71
  86 52 52
  87 137 137
  88 93 93
  89 83 83
  90 52 52
  91 45 45
  92 59 59
  93 35 35
  94 52 52
  95 54 54
  96 59 59
  97 72 72
  98 74 74
  99 77 77
  100 155 155
  101 62 62
  102 61 61
  103 144 144
  104 63 63
  105 58 58
  106 39 39
  107 43 43
  108 41 41
  109 27 27
  110 44 44
  111 48 48
  112 60 60
  113 59 59
  114 999 999
  115 274 274
  116 126 126
  117 106 106
  118 66 66
  119 48 48
  120 43 43
  121 46 46
  122 46 46
  123 51 51
  124 53 53
  125 38 38
  126 44 44
  127 50 50
  128 415 415
  129 114 114
  130 252 252
  131 170 170
  132 132 132
  133 225 225
  134 70 70
  135 70 70
  136 49 49
  137 35 35
  138 47 47
  139 29 29
  140 31 31
  141 39 39
  142 56 56
  143 36 36
  144 89 89
  145 54 54
  146 105 105
  147 604 604
  148 126 126
  149 104 104
  150 47 47
  151 46 46
  152 50 50
  153 39 39
  154 31 31
  155 52 52
  156 52 52
  157 47 47
  158 59 59
  159 47 47
  160 100 100
  161 58 58
  162 52 52
  163 50 50
  164 50 50
  165 50 50
  166 58 58
  167 43 43
  168 56 56
  169 42 42
  170 45 45
  171 45 45
  172 37 37
  173 61 61
  174 84 84
  175 70 70
  176 53 53
  177 60 60
  178 48 48
  179 38 38
  180 49 49
  181 47 47
  182 51 51
  183 43 43
  184 13 13
  185 51 51
  186 48 48
  187 43 43
  188 62 62
  189 63 63
  190 55 55
  191 70 70
  192 41 41
  193 48 48
  194 42 42
  195 38 38
  196 50 50
  197 40 40
  198 55 55
  199 52 52
  200 36 36
  201 33 33
  202 141 141
  203 49 49
  204 59 59
  205 44 44
  206 49 49
  207 37 37
  208 29 29
  209 35 35
  210 46 46
  211 51 51
  212 37 37
  213 39 39
  214 36 36
  215 39 39
  216 43 43
  217 51 51
  218 762 762
  219 189 189
  220 91 91
  221 49 49
  222 38 38
  223 34 34
  224 46 46
  225 44 44
  226 35 35
  227 47 47
  228 38 38
  229 45 45
  230 93 93
  231 66 66
  232 881 881
  233 197 197
  234 102 102
  235 49 49
  236 43 43
  237 40 40
  238 45 45
  239 32 32
  240 29 29
  241 30 30
  242 32 32
  243 29 29
  244 27 27
  245 30 30
  246 32 32
  247 37 37
  248 35 35
  249 43 43
  250 30 30
  251 33 33
  252 30 30
  253 37 37
  254 36 36
  255 28 28
  256 26 26
  257 35 35
  258 37 37
  259 37 37
  260 40 40
  261 41 41
  262 33 33
  263 16 16
  264 36 36
  265 38 38
  266 22 22
  267 34 34
  268 22 22
  269 27 27
  270 38 38
  271 28 28
  272 33 33
  273 28 28
  274 32 32
  275 33 33
  276 25 25
  277 33 33
  278 23 23
  279 34 34
  280 38 38
  281 44 44
  282 37 37
  283 26 26
  284 32 32
  285 36 36
  286 30 30
  287 41 41
  288 30 30
  289 37 37
  290 38 38
  291 38 38
  292 81 81
  293 50 50
  294 39 39
  295 37 37
  296 34 34
  297 28 28
  298 34 34
  299 25 25
  300 32 32
  301 29 29
  302 47 47
  303 23 23
  304 33 33
  305 36 36
  306 33 33
  307 22 22
  308 27 27
  309 21 21
  310 36 36
  311 27 27
  312 36 36
  313 36 36
  314 27 27
  315 34 34
  316 32 32
  317 31 31
  318 23 23
  319 31 31
  320 53 53
  321 51 51
  322 21 21
  323 31 31
  324 29 29
  325 27 27
  326 40 40
  327 32 32
  328 26 26
  329 28 28
  330 32 32
  331 37 37
  332 27 27
  333 31 31
  334 41 41
  335 37 37
  336 51 51
  337 30 30
  338 30 30
  339 39 39
  340 34 34
  341 26 26
  342 36 36
  343 39 39
  344 37 37
  345 39 39
  346 26 26
  347 25 25
  348 23 23
  349 35 35
  350 32 32
  351 32 32
  352 37 37
  353 23 23
  354 19 19
  355 34 34
  356 26 26
  357 38 38
  358 35 35
  359 32 32
  360 29 29
  361 37 37
  362 31 31
  363 39 39
  364 37 37
  365 38 38
  366 33 33
  367 36 36
  368 30 30
  369 36 36
  370 41 41
  371 44 44
  372 20 20
  373 35 35
  374 24 24
  375 23 23
  376 27 27
  377 38 38
  378 30 30
  379 29 29
  380 26 26
  381 32 32
  382 31 31
  383 39 39
  384 32 32
  385 36 36
  386 29 29
  387 34 34
  388 40 40
  389 33 33
  390 34 34
  391 43 43
  392 38 38
  393 35 35
  394 39 39
  395 38 38
  396 32 32
  397 38 38
  398 37 37
  399 48 48
  400 41 41
  401 19 19
  402 25 25
  403 9 9
  404 14 14
  405 13 13
  406 19 19
  407 17 17
  408 24 24
  409 26 26
  410 21 21
  411 15 15
  412 21 21
  413 18 18
  414 24 24
  415 33 33
  416 21 21
  417 21 21
  418 8 8
  419 25 25
  420 14 14
  421 23 23
  422 22 22
  423 27 27
  424 20 20
  425 18 18
  426 19 19
  427 21 21
  428 19 19
  429 20 20
  430 16 16
  431 22 22
  432 24 24
  433 18 18
  434 24 24
  435 14 14
  436 25 25
  437 14 14
  438 23 23
  439 10 10
  440 14 14
  441 27 27
  442 21 21
  443 18 18
  444 34 34
  445 23 23
  446 18 18
  447 16 16
  448 25 25
  449 31 31
  450 28 28
  451 20 20
  452 27 27
  453 3 3
  454 13 13
  455 26 26
  456 18 18
  457 21 21
  458 9 9
  459 25 25
  460 23 23
  461 24 24
  462 17 17
  463 23 23
  464 28 28
  465 22 22
  466 21 21
  467 26 26
  468 30 30
  469 29 29
  470 9 9
  471 27 27
  472 28 28
  473 31 31
  474 22 22
  475 20 20
  476 22 22
  477 15 15
  478 26 26
  479 14 14
  480 27 27
  481 37 37
  482 22 22
  483 18 18
  484 25 25
  485 25 25
  486 17 17
  487 24 24
  488 21 21
  489 20 20
  490 25 25
  491 24 24
  492 18 18
  493 20 20
  494 26 26
  495 18 18
  496 23 23
  497 24 24
  498 26 26
  499 25 25
  500 21 21