ACCESSION: MSBNK-MSSJ-MSJ00102
RECORD_TITLE: (R)-4-methyloctadecanal; GC-FI-TOF; MS; M*+ ;[M+H]+; FI voltage 10 kV
DATE: 2018.12.05
AUTHORS: Masayo Sekimoto, Takemichi Nakamura, Molecular Structure Characterization Unit, RIKEN
LICENSE: CC BY
COPYRIGHT: Masayo Sekimoto, Takemichi Nakamura, Molecular Structure Characterization Unit, RIKEN
PUBLICATION: Mori K, Akasaka K. Pheromone synthesis. Part 256: Synthesis of the four stereoisomers of 5,11-dimethylpentacosane, a new sex pheromone component of the male Galleria mellonella (L.), with high stereochemical purities as determined by the derivatization-HPLC analysis of the eight stereoisomers of 5,11-dimethyl-8-pentacosanol. Tetrahedron. 2015 Jun 17;71(24):4102-15. doi: 10.10.1016/j.tet2015.04.107.
COMMENT: JMS-T100GCV is a reflectron TOF (reTOF) MS. Temperature of the ion source and GC-transfer line was 250 C. Resolving power (FWHM, nominal) was 7,000.
COMMENT: Field ionization (FI) voltage, which is defined as the voltage between the emitter surface and the electrode, was 10 kV (default). Typical accuracy level expected was 10 ppm. Postrun m/z adjustment was made at a known mass, 282.2923.
COMMENT: This record was created by the financial support of MEXT/JSPS KAKENHI Grant Number 16HP2005 to the Mass Spectrometry Society of Japan.

CH$NAME: (R)-4-methyloctadecanal
CH$COMPOUND_CLASS: Synthetic compounds
CH$FORMULA: C19H38O
CH$EXACT_MASS: 282.2923
CH$SMILES: C[C@H](CCCCCCCCCCCCCC)CCC=O
CH$IUPAC: InChI=1S/C19H38O/c1-3-4-5-6-7-8-9-10-11-12-13-14-16-19(2)17-15-18-20/h18-19H,3-17H2,1-2H3/t19-/m1/s1
CH$LINK: INCHIKEY JBGJNZXYIIAYDM-LJQANCHMSA-N
CH$LINK: PUBCHEM CID:132560103

AC$INSTRUMENT: JMS-T100GCV (JEOL, Akishima, Japan) coupled to Agilent 7890A gas chromatography.
AC$INSTRUMENT_TYPE: GC-FI-TOF
AC$MASS_SPECTROMETRY: MS_TYPE MS
AC$MASS_SPECTROMETRY: ION_MODE POSITIVE
AC$MASS_SPECTROMETRY: IONIZATION FI
AC$CHROMATOGRAPHY: CARRIER_GAS He, flow rate 1.5 mL.
AC$CHROMATOGRAPHY: COLUMN_NAME HP-5 19091J-413 USD364547H (Agilent), length 30 m, I.D. 0.32 mm, thickness 0.25 micrometer
AC$CHROMATOGRAPHY: COLUMN_TEMPERATURE Ramped at 50 C for 4 min. From 70 C to 325 C by 30 C/min and held at 0.833 min.
AC$CHROMATOGRAPHY: INJECTION_TEMPERATURE 250 C
AC$CHROMATOGRAPHY: RETENTION_TIME 11.12 min

PK$SPLASH: splash10-01q9-0090000000-9dd9db4ab32f70b64219
PK$NUM_PEAK: 16
PK$PEAK: m/z int. rel.int.
  29.039 6 59
  44.026 7 67
  85.065 8 84
  222.236 8 81
  223.243 16 158
  236.250 9 92
  238.266 36 365
  239.271 10 104
  254.262 7 66
  264.282 87 868
  265.284 18 178
  267.268 13 126
  281.287 14 138
  282.292 100 999
  283.297 43 429
  284.305 6 63