ACCESSION: MSBNK-MSSJ-MSJ00614
RECORD_TITLE: 3,4-Epoxy-7-octene; GC-FI-TOF; MS; positive; FI; 10 kV
DATE: 2021.02.19
AUTHORS: Eiyu Imai, Takemichi Nakamura, Molecular Structure Characterization Unit, RIKEN
LICENSE: CC BY
COPYRIGHT: Eiyu Imai, Takemichi Nakamura, Molecular Structure Characterization Unit, RIKEN
PUBLICATION: Kenji Mori, Tetrahedron 74 (2018) 1444-1448, DOI:10.1016/j.tet.2018.01.052.
COMMENT: JMS-T100GCV is a reflectron time-of-flight (reTOF) mass spectrometer. Temperature of the GC-transfer line was 200 C. Resolving power (FWHM, nominal) was 7,000.
COMMENT: Field ionization (FI) voltage, which is defined as the voltage between the emitter surface and the electrode, was 10 kV (default). Typical accuracy level expected was 10 ppm. Postrun m/z adjustment was made at a known mass, 126.1045.
COMMENT: This record was created by the financial support of MEXT/JSPS KAKENHI Grant Number 20HP8016 to the Mass Spectrometry Society of Japan.

CH$NAME: 3,4-Epoxy-7-octene
CH$COMPOUND_CLASS: Non-natural product
CH$FORMULA: C8H14O
CH$EXACT_MASS: 126.10447
CH$SMILES: CCC1OC1CCC=C
CH$IUPAC: InChI=1S/C8H14O/c1-3-5-6-8-7(4-2)9-8/h3,7-8H,1,4-6H2,2H3
CH$LINK: INCHIKEY PVSFKLZEGPBMKX-UHFFFAOYSA-N

AC$INSTRUMENT: JMS-T100GCV (JEOL, Akishima, Japan) coupled to Agilent 7890A (Agilent, Wilmington, USA) gas chromatograph.
AC$INSTRUMENT_TYPE: GC-FI-TOF
AC$MASS_SPECTROMETRY: MS_TYPE MS
AC$MASS_SPECTROMETRY: ION_MODE POSITIVE
AC$MASS_SPECTROMETRY: IONIZATION FI
AC$CHROMATOGRAPHY: CARRIER_GAS Helium
AC$CHROMATOGRAPHY: COLUMN_NAME HP-5 19091 J-413 USD364547H (Agilent, Wilmington, USA), length 30.0 m, I.D. 0.32 mm, thickness 0.25 micrometer.
AC$CHROMATOGRAPHY: COLUMN_TEMPERATURE Held at initial oven temp. 70 C for 4 min and ramped at the rate of 30 C/min to 320 C and held at the final temp. for 1.67 min.
AC$CHROMATOGRAPHY: INJECTION_TEMPERATURE 250 C
AC$CHROMATOGRAPHY: RETENTION_TIME 4.12 min.

PK$SPLASH: splash10-03di-2900000000-5e1e26cd9f07f0aef6b4
PK$NUM_PEAK: 4
PK$PEAK: m/z int. rel.int.
  85.064 25.62 256
  97.065 18.01 180
  111.080 100.00 999
  126.104 32.44 324