ACCESSION: MSBNK-NAIST-KNA00503
RECORD_TITLE: L-(+)-Arginine; LC-ESI-ITFT; MS; NEG
DATE: 2016.01.19 (Created 2009.11.18, modified 2011.08.03)
AUTHORS: Takahashi H, Kanaya S, Ogasawara N, Graduate School of Information Science, NAIST
LICENSE: CC BY-SA
COMMENT: [Spectral] L-Arginine (exact mass = 174.11168) and L-Histidine (exact mass = 155.06948) were not completely separated on HPLC under the present analytical conditions as described in "AC$XXX". Additionally some of the peaks in this data contains dimers and other unidentified ions.

CH$NAME: L-Arginine
CH$NAME: (S)-2-Amino-5-guanidinovaleric acid
CH$NAME: L-(+)-Arginine
CH$COMPOUND_CLASS: Natural Product
CH$FORMULA: C6H14N4O2
CH$EXACT_MASS: 174.11168
CH$SMILES: NC(=N)NCCC[C@H](N)C(O)=O
CH$IUPAC: InChI=1S/C6H14N4O2/c7-4(5(11)12)2-1-3-10-6(8)9/h4H,1-3,7H2,(H,11,12)(H4,8,9,10)/t4-/m0/s1
CH$LINK: CAS 74-79-3
CH$LINK: CHEBI 16467
CH$LINK: KEGG C00062
CH$LINK: KNAPSACK C00001340
CH$LINK: NIKKAJI J9.182K
CH$LINK: PUBCHEM 3362
CH$LINK: INCHIKEY ODKSFYDXXFIFQN-BYPYZUCNSA-N
CH$LINK: COMPTOX DTXSID6041056

AC$INSTRUMENT: LTQ Orbitrap XL, Thermo Scientfic
AC$INSTRUMENT_TYPE: LC-ESI-ITFT
AC$MASS_SPECTROMETRY: MS_TYPE MS
AC$MASS_SPECTROMETRY: ION_MODE NEGATIVE
AC$MASS_SPECTROMETRY: COLLISION_ENERGY 35eV
AC$MASS_SPECTROMETRY: IONIZATION ESI
AC$CHROMATOGRAPHY: COLUMN_NAME TOSOH TSKgel ODS-100V 5um Part no. 21456
AC$CHROMATOGRAPHY: FLOW_GRADIENT 0min:3%, 45min:97%, 50min:97%, 50.1:3%, 57min:3% (acetonitrile)
AC$CHROMATOGRAPHY: FLOW_RATE 0.5 ml/min
AC$CHROMATOGRAPHY: RETENTION_TIME 4.131042 min
AC$CHROMATOGRAPHY: SOLVENT A 0.1%formate-water
AC$CHROMATOGRAPHY: SOLVENT B 0.1%formate-acetonitrile

MS$FOCUSED_ION: BASE_PEAK 173.104523

PK$SPLASH: splash10-0fk9-0946231100-4ff969471853c174d6f5
PK$NUM_PEAK: 1201
PK$PEAK: m/z int. rel.int.
  102.956901 1938.049927 1
  103.190591 928.953125 1
  107.414097 833.088745 1
  107.912192 850.606445 1
  107.986782 861.145874 1
  108.056779 3607.005615 2
  110.072381 12365.805664 8
  111.075625 953.346802 1
  112.070454 854.463135 1
  112.088164 5592.077637 3
  112.981764 1445.460205 1
  112.983806 3995.961426 2
  112.985848 149114.000000 92
  112.987663 4236.793945 3
  112.989479 1231.175293 1
  112.991748 1192.356323 1
  113.989032 1875.418823 1
  114.056201 955.065063 1
  117.344998 829.252441 1
  121.677629 847.312256 1
  123.698397 826.343750 1
  125.538142 827.312744 1
  128.060510 906.755371 1
  129.975841 1835.127075 1
  131.004318 1282.854980 1
  131.056459 2845.755615 2
  131.060427 1190.327026 1
  131.071767 2100.708252 1
  131.072617 2362.132813 1
  131.075169 2651.977783 2
  131.076587 2085.058350 1
  131.077721 4776.301758 3
  131.078855 7179.407715 4
  131.080273 13521.708008 8
  131.082824 550249.375000 338
  131.085093 16222.895508 10
  131.087645 4405.039551 3
  131.089913 3389.251465 2
  131.092465 1519.135986 1
  131.093316 898.183472 1
  131.108914 2837.228027 2
  132.079458 2137.431641 1
  132.085767 19315.113281 12
  132.552196 1002.711060 1
  132.623152 864.784180 1
  133.086631 1221.946167 1
  133.618177 933.346680 1
  133.820923 851.073608 1
  136.043245 860.351929 1
  137.035549 9250.564453 6
  137.745066 901.190308 1
  140.899916 988.402100 1
  141.673779 897.484863 1
  142.946467 1277.837402 1
  143.430421 832.191284 1
  144.880317 978.136353 1
  145.050803 853.414185 1
  146.938443 1908.061646 1
  146.960992 864.668213 1
  147.492225 958.125000 1
  147.777588 845.778076 1
  148.968573 843.063599 1
  149.866087 848.722412 1
  154.028862 3730.398682 2
  154.038975 1049.893311 1
  154.044755 1044.776733 1
  154.049451 2460.686279 2
  154.052702 4068.682617 3
  154.054508 1548.490967 1
  154.055953 6705.712402 4
  154.057398 6447.045410 4
  154.058843 21607.267578 13
  154.062095 760504.625000 468
  154.063901 13093.892578 8
  154.064985 21126.548828 13
  154.068598 6119.708008 4
  154.071488 3994.497070 2
  154.074379 2259.876465 1
  154.075463 1752.559204 1
  154.084858 1141.126953 1
  154.095338 3119.301025 2
  154.161857 1213.580566 1
  154.974023 846.474365 1
  155.058985 3112.606934 2
  155.065551 37833.960938 23
  156.062636 1090.702026 1
  156.066319 2304.879395 1
  156.074423 1241.940430 1
  156.077739 37592.566406 23
  156.080686 1024.715576 1
  157.011738 9769.717773 6
  157.080898 1521.739502 1
  160.967031 1515.149902 1
  162.982483 1329.110229 1
  172.844396 910.113281 1
  172.906665 1148.368530 1
  172.985730 3425.887207 2
  173.051946 964.925293 1
  173.064850 7071.229492 4
  173.066570 876.501587 1
  173.067861 1224.517578 1
  173.070442 1133.705444 1
  173.072592 1716.071899 1
  173.078185 1371.696655 1
  173.082917 1802.662964 1
  173.084208 2527.897217 2
  173.085929 2787.211426 2
  173.088080 2486.333008 2
  173.089370 5781.540527 4
  173.093243 8085.489746 5
  173.097115 14596.109375 9
  173.098836 10732.625977 7
  173.100557 37245.937500 23
  173.104430 1625111.250000 999
  173.107872 40164.585938 25
  173.111745 11963.682617 7
  173.115618 8998.016602 6
  173.119061 4554.064453 3
  173.122503 1260.897705 1
  173.125086 2115.948242 1
  173.127668 840.074951 1
  173.128959 1033.843384 1
  173.130250 1401.107666 1
  173.131541 1341.567627 1
  173.136276 1238.563721 1
  173.137997 1024.914795 1
  173.139289 1461.225220 1
  173.141871 956.298828 1
  173.144023 6787.739258 4
  173.223682 2871.104248 2
  173.302965 907.848877 1
  174.100966 10221.626953 6
  174.103571 1906.276733 1
  174.107477 92746.023438 57
  174.110949 2211.904541 1
  175.107885 1162.827026 1
  175.110074 1583.682617 1
  175.491575 853.979248 1
  176.020716 901.875854 1
  176.044102 33885.425781 21
  178.059000 1360.374634 1
  178.539843 1000.979736 1
  178.977391 1994.775757 1
  178.993677 830.165527 1
  179.618768 831.874634 1
  180.972609 27514.812500 17
  184.528612 902.531494 1
  184.530507 1353.822998 1
  190.927967 1291.325806 1
  195.085798 3242.155029 2
  196.030272 2777.065186 2
  197.062083 1088.361816 1
  198.026227 1292.624390 1
  198.935957 1648.071289 1
  199.229436 851.411377 1
  199.304369 826.500610 1
  201.506219 831.703613 1
  201.992940 1118.539185 1
  204.956741 3695.109863 2
  206.972185 13001.181641 8
  208.988960 2204.335938 1
  209.072322 911.977905 1
  209.080889 4817.331055 3
  209.996633 2082.806396 1
  211.077645 1727.905396 1
  212.012385 2482.871582 2
  212.020550 9309.266602 6
  213.085511 4209.666992 3
  214.017663 2989.177490 2
  215.072695 1106.816040 1
  215.989141 1823.523315 1
  217.068470 895.557861 1
  218.285026 814.440186 1
  219.109311 2186.056396 1
  221.991694 1203.938965 1
  222.032943 1325.759033 1
  222.039819 5532.066895 3
  222.043569 6301.240723 4
  222.049195 339320.000000 209
  222.054197 6934.560547 4
  222.059198 1874.194458 1
  222.065450 1555.140015 1
  223.042735 821.285034 1
  223.045882 1712.222534 1
  223.052175 20523.636719 13
  224.025219 6223.839355 4
  224.053095 2968.037842 2
  224.998904 1090.011597 1
  228.031201 901.845947 1
  228.646581 816.693359 1
  229.039008 1300.032471 1
  229.272325 836.961060 1
  230.110875 1063.552856 1
  231.055524 1652.857178 1
  231.062823 27188.535156 17
  232.066102 1384.296143 1
  232.086809 861.866211 1
  232.797856 869.866211 1
  233.059796 7640.061035 5
  235.031705 1084.761230 1
  235.482331 842.922607 1
  236.167219 892.627075 1
  238.014276 1431.077759 1
  238.931287 1009.988770 1
  239.039478 8755.585938 5
  240.896381 1720.871948 1
  241.025703 3243.339355 2
  241.063884 898.647461 1
  241.066712 1995.461304 1
  241.068834 1089.410156 1
  241.073077 3567.239258 2
  241.076613 1477.576050 1
  241.079441 5904.912109 4
  241.081563 5005.638184 3
  241.085099 18897.853516 12
  241.091464 844516.687500 519
  241.095000 6015.888672 4
  241.097122 17652.839844 11
  241.103488 4900.851074 3
  241.109854 4194.337891 3
  241.115513 1893.762329 1
  241.117635 1573.132568 1
  241.123294 1038.939819 1
  241.124708 941.196899 1
  241.156545 2849.521973 2
  241.287493 1535.670898 1
  242.035582 1283.420410 1
  242.088235 7194.410156 4
  242.094640 50268.660156 31
  243.066855 7547.718750 5
  243.095496 3036.677979 2
  244.031254 35248.445313 22
  244.071592 900.768433 1
  245.034010 2384.410400 1
  247.682957 863.639282 1
  248.953051 1012.886353 1
  248.959730 64337.890625 40
  249.963181 1766.663452 1
  250.942666 1069.513550 1
  253.041380 1346.681274 1
  253.986257 4502.127441 3
  254.916441 911.190918 1
  256.627465 813.399170 1
  256.954771 1621.877197 1
  257.065310 5217.136719 3
  258.081394 7933.433105 5
  260.004938 826.644531 1
  261.994929 2875.659668 2
  263.073459 1526.161133 1
  264.059731 1146.307373 1
  264.934201 1556.482544 1
  266.075224 18822.666016 12
  267.078441 922.512207 1
  268.015206 4573.912109 3
  268.051685 1144.379150 1
  268.473387 814.113159 1
  270.030967 13312.075195 8
  271.033896 1541.890991 1
  271.070993 1300.892700 1
  271.102194 1791.048950 1
  272.021232 1919.830688 1
  273.028462 6319.977051 4
  274.007016 895.105469 1
  274.011301 3783.725098 2
  274.019871 1297.309814 1
  274.031012 1237.733032 1
  279.041241 1423.861328 1
  281.036872 6320.435547 4
  281.461047 830.621094 1
  283.102580 1332.214844 1
  284.731281 876.186157 1
  285.117457 25392.664063 16
  285.122005 1041.100342 1
  286.120627 2958.599609 2
  287.057415 5444.747559 3
  287.096930 2273.319580 1
  288.056994 1001.318115 1
  289.072946 6991.116699 4
  290.036414 46606.281250 29
  291.040350 2175.100342 1
  292.986213 2307.245850 1
  293.053496 10729.421875 7
  293.062975 1686.651611 1
  293.523227 1128.425537 1
  299.049789 4512.210449 3
  301.047059 870.647827 1
  301.764796 869.970703 1
  301.989740 963.200073 1
  303.062410 3519.282471 2
  304.711808 874.542236 1
  308.000187 1295.699463 1
  308.367140 893.046509 1
  309.061951 1228.992554 1
  309.070163 3312.057617 2
  309.079403 217673.578125 134
  309.087616 4730.399414 3
  309.131767 1526.471924 1
  309.242699 842.056396 1
  310.075566 2320.725586 1
  310.081755 15467.302734 10
  310.135406 906.147339 1
  311.082772 2132.173584 1
  312.018865 22442.046875 14
  312.023031 1763.212769 1
  315.035321 3559.269287 2
  315.993570 858.511963 1
  316.947670 35649.750000 22
  316.993515 923.325562 1
  317.951080 1710.799561 1
  319.650245 843.671509 1
  320.013343 974.417969 1
  321.974543 1259.795044 1
  323.915274 878.319702 1
  325.052714 7216.222656 4
  326.069303 1664.099731 1
  327.042615 3443.427246 2
  327.175626 1156.341431 1
  327.993355 1308.301636 1
  328.174116 47414.046875 29
  328.183102 880.802124 1
  329.177184 4369.858398 3
  330.099859 1661.845947 1
  331.085596 1168.170898 1
  331.098116 1410.556763 1
  331.103808 3798.083984 2
  331.112914 224968.875000 138
  331.123159 3639.565186 2
  331.133405 1806.161499 1
  331.142513 1020.259888 1
  331.515109 925.375366 1
  332.111200 3352.642334 2
  332.116918 24022.607422 15
  333.062324 2184.050293 1
  333.088739 6758.025391 4
  333.099076 991.464844 1
  333.115157 851.323730 1
  334.061371 888.758301 1
  335.078825 6959.461914 4
  337.094985 3241.382813 2
  337.462450 841.974609 1
  341.191807 3739.604980 2
  347.087235 1250.894531 1
  347.194768 1163.214844 1
  347.204546 3416.247559 2
  347.215547 219269.625000 135
  347.225327 4216.420898 3
  347.237551 900.962646 1
  347.995506 1238.539185 1
  348.212695 3659.201660 2
  348.218834 25117.197266 15
  349.024350 1002.450073 1
  349.222776 993.632202 1
  350.041679 1544.666870 1
  350.123356 1730.127808 1
  350.129545 824.981323 1
  350.134496 3628.372559 2
  350.139447 1573.806885 1
  350.144399 9954.521484 6
  350.155540 557847.875000 343
  350.161729 6310.082031 4
  350.165443 9889.315430 6
  350.175347 2777.406250 2
  350.177823 2735.609619 2
  350.186490 2149.895996 1
  350.197633 1356.253052 1
  350.201347 940.449829 1
  351.152955 9646.661133 6
  351.159171 65245.250000 40
  352.118433 838.126099 1
  352.130917 10803.259766 7
  352.158384 2042.150024 1
  352.163378 2352.341797 1
  353.095420 4601.015625 3
  353.105449 4124.379395 3
  353.134283 1038.933472 1
  357.060883 1084.123779 1
  358.023967 20891.328125 13
  359.026937 2130.646484 1
  361.040379 2581.322998 2
  362.043044 1302.630981 1
  362.608554 866.509888 1
  363.979593 1175.471313 1
  366.019022 1132.012939 1
  366.128855 8406.276367 5
  367.037200 5351.617676 3
  367.307037 821.615234 1
  367.313687 814.999512 1
  368.127678 998.741699 1
  369.035440 1106.755981 1
  369.072945 1727.580444 1
  369.145293 981.567627 1
  369.150653 2289.230713 1
  369.162714 2402.408203 1
  369.169414 1439.585571 1
  369.174775 4672.590820 3
  369.185496 13532.979492 8
  369.197558 737199.187500 453
  369.208280 13234.435547 8
  369.219003 3442.719727 2
  369.221684 3249.526367 2
  369.232407 2340.955322 1
  369.243131 1569.992188 1
  369.247153 1471.554688 1
  369.320893 1851.564575 1
  370.188663 1863.921753 1
  370.200774 84187.554688 52
  370.211540 1717.763306 1
  371.050042 1233.869263 1
  371.056794 828.892700 1
  371.172956 4573.864746 3
  371.199978 1729.496460 1
  371.205383 2680.107178 2
  372.136765 18625.482422 11
  372.203233 1295.681885 1
  373.045791 918.332031 1
  373.141099 2297.045654 1
  374.732662 928.900513 1
  374.829988 821.284546 1
  375.046707 1295.058350 1
  375.076899 4282.765137 3
  377.054082 3458.704102 2
  377.066532 170074.687500 105
  377.077599 2542.389160 2
  378.070068 11067.027344 7
  379.070645 2831.071533 2
  380.005211 16902.517578 10
  381.010674 1209.305176 1
  381.048615 841.593750 1
  381.085156 2082.639893 1
  382.092089 3804.814941 2
  383.022280 3821.131348 2
  383.192286 3613.742188 2
  384.934256 7917.041504 5
  385.032729 1922.396118 1
  385.171225 12365.444336 8
  386.132758 999.859009 1
  386.174333 1912.296509 1
  390.100992 4166.220215 3
  393.040519 15200.147461 9
  393.221658 17071.072266 10
  394.043510 1844.238159 1
  394.223865 2041.388794 1
  395.979153 1254.439087 1
  396.160839 1869.124390 1
  396.866425 1006.560425 1
  397.968090 1296.084595 1
  398.094115 849.580811 1
  398.137638 7298.720703 4
  399.099955 10245.344727 6
  399.140629 1216.497803 1
  400.103564 2062.181396 1
  400.127757 987.144043 1
  401.135248 3348.462891 2
  404.352654 867.584717 1
  405.174225 3943.360840 2
  408.114697 3960.172363 2
  408.916519 1032.124512 1
  409.002457 1320.410522 1
  409.013396 1010.945801 1
  409.143141 3026.801514 2
  410.111136 1680.505127 1
  415.202761 38399.582031 24
  415.217147 1300.126099 1
  416.206791 3197.311279 2
  417.179048 4950.464355 3
  418.132100 1867.531372 1
  418.143407 127098.039063 78
  418.156331 2200.528076 1
  419.146780 16438.193359 10
  420.150515 1313.887085 1
  421.082754 4056.903809 2
  421.092549 3095.196777 2
  422.086901 1091.218872 1
  424.660984 994.442993 1
  426.011680 12229.555664 8
  427.015181 1381.694214 1
  427.091879 1172.287354 1
  427.156922 6349.301758 4
  428.161127 860.959351 1
  429.153761 1710.572632 1
  431.168018 1721.590454 1
  431.178167 1607.550781 1
  434.116111 5830.294434 4
  435.024950 2705.829590 2
  437.025493 1082.521606 1
  437.141163 993.493774 1
  437.154978 1455.949341 1
  437.161885 1498.153320 1
  437.168793 4319.905762 3
  437.184336 274076.937500 168
  437.199880 4613.045410 3
  437.211970 1128.376709 1
  437.229242 1028.747803 1
  438.187735 33224.574219 20
  439.038129 1500.246826 1
  439.191115 2337.729980 1
  440.107224 999.400879 1
  440.124668 21405.632813 13
  441.127711 2880.719482 2
  443.064811 1450.875244 1
  444.141583 1991.270142 1
  445.037756 1324.314575 1
  445.053720 109156.437500 67
  445.183241 2184.875244 1
  446.057651 8529.364258 5
  446.132415 1435.565308 1
  447.059624 1633.025391 1
  447.139999 1869.680542 1
  447.332988 2665.407959 2
  447.993310 4844.611328 3
  450.082276 984.319092 1
  451.010975 3200.593506 2
  452.922541 5093.765137 3
  453.159379 10119.577148 6
  454.161617 1218.885498 1
  454.176246 1379.280884 1
  455.009443 2121.085449 1
  455.148837 1628.407104 1
  459.228610 3208.479004 2
  461.028090 11329.868164 7
  461.170260 3591.518799 2
  461.209555 6109.671875 4
  462.041548 929.941895 1
  462.169169 1946.508179 1
  463.016938 1398.351440 1
  463.184511 9013.246094 6
  464.148410 3667.087646 2
  464.188086 1193.553711 1
  466.125180 1948.159546 1
  466.479028 1038.845337 1
  467.088741 7665.381348 5
  467.165040 4180.220703 3
  469.036363 1087.576660 1
  469.122738 1492.045166 1
  470.105242 2656.729736 2
  471.054133 3041.073242 2
  473.162724 1046.449707 1
  473.994138 1015.895996 1
  475.536182 931.852173 1
  476.102895 1933.320679 1
  477.001116 1240.589966 1
  477.166492 1720.534180 1
  478.101301 1003.046265 1
  481.211323 3754.248047 2
  483.189834 31879.761719 20
  484.194739 3771.030518 2
  485.196726 1181.977417 1
  486.112717 1276.020508 1
  486.130941 92210.648438 57
  486.147142 2071.709961 1
  487.045519 907.853760 1
  487.132853 10014.199219 6
  489.070375 2034.663208 1
  489.078548 3005.346191 2
  489.148034 2929.169434 2
  490.149041 915.912598 1
  492.086041 1403.379639 1
  492.139666 1500.123047 1
  493.309230 1021.528076 1
  493.999279 8898.422852 5
  495.077651 1333.120972 1
  495.144256 3442.101807 2
  499.165271 4302.593750 3
  500.711189 830.983154 1
  502.104837 8763.015625 5
  502.285566 24895.164063 15
  503.013723 1218.123657 1
  503.109652 1275.607422 1
  503.288791 3416.780762 2
  504.290745 875.237793 1
  505.154091 1866.090454 1
  505.173397 174982.437500 108
  505.190559 2322.766113 1
  505.224885 7438.850586 5
  506.176684 21764.242188 13
  507.178646 1980.109985 1
  507.202385 1986.824829 1
  507.310307 899.939453 1
  507.921799 1047.676758 1
  508.099187 1193.799072 1
  508.112170 14049.446289 9
  508.164108 3147.453369 2
  508.181423 886.966919 1
  508.315640 980.886353 1
  509.115548 2508.447021 2
  509.169810 1077.084717 1
  509.308762 1181.205811 1
  509.973912 1157.809204 1
  511.129055 3109.763428 2
  513.040347 46339.617188 28
  513.051325 1552.470459 1
  514.045153 3988.044434 2
  515.128007 2362.745117 1
  515.979483 978.053833 1
  518.067303 2126.760010 1
  518.745225 920.672363 1
  518.997556 1124.178345 1
  519.990797 891.873657 1
  520.910513 3383.177734 2
  521.146443 9590.384766 6
  521.306067 1262.895630 1
  521.328555 84000.031250 52
  521.990359 1031.279175 1
  522.150371 2033.554565 1
  522.330754 12391.726563 8
  522.996727 2073.111084 1
  524.266723 52586.632813 32
  524.278063 1206.813354 1
  525.270587 8020.886230 5
  526.243124 6169.987793 4
  526.275056 1060.824951 1
  527.206929 27106.638672 17
  528.210079 4913.362305 3
  529.016042 7076.975098 4
  529.158597 1100.910522 1
  529.195395 14495.627930 9
  530.158100 2243.945313 1
  530.197309 1221.529663 1
  531.172002 5172.532227 3
  532.096046 1042.919800 1
  532.135470 4862.363281 3
  534.112263 1936.214478 1
  535.076730 3684.260498 2
  535.151568 2866.897949 2
  535.305970 2166.382324 1
  536.884229 1006.556641 1
  537.025274 1429.744629 1
  537.302825 1828.229614 1
  538.091962 1154.514038 1
  539.041224 1961.960327 1
  541.151780 1451.173340 1
  543.181465 1280.779419 1
  543.310644 57772.410156 36
  544.091477 981.539795 1
  544.312140 9158.688477 6
  545.155250 3085.054932 2
  545.169679 1597.614502 1
  545.193729 1001.059204 1
  545.285133 2314.467529 1
  545.316408 1324.439453 1
  546.248677 93170.085938 57
  547.253474 12330.977539 8
  548.108279 1785.894409 1
  548.256196 1022.195190 1
  548.729447 952.269043 1
  549.191154 3371.832520 2
  550.201646 905.523438 1
  551.178257 37441.570313 23
  552.130507 1236.835327 1
  552.181984 5018.812012 3
  554.118812 56680.550781 35
  554.138528 1005.348511 1
  555.120701 5812.785645 4
  555.197312 3137.340820 2
  555.264050 841.028320 1
  556.204607 1386.374023 1
  557.068057 1603.326172 1
  557.135133 1521.745117 1
  557.304119 2527.483643 2
  558.137744 918.826538 1
  559.048154 1995.565308 1
  559.285475 2170.209229 1
  559.803109 940.304565 1
  560.126056 1562.434326 1
  560.243789 1039.616699 1
  561.986549 3893.276855 2
  562.223226 3590.222900 2
  563.131030 1413.913696 1
  563.302751 6141.717773 4
  564.304335 1271.859863 1
  565.290818 82268.242188 51
  566.295166 13127.609375 8
  567.154157 3235.297852 2
  567.332828 32396.568359 20
  568.230008 6639.854004 4
  568.337506 4839.756836 3
  570.092480 4868.385742 3
  570.272541 10862.004883 7
  571.171548 1357.873169 1
  572.204546 869.127197 1
  573.141827 1057.016724 1
  573.159974 91392.242188 56
  573.172936 1413.510254 1
  573.211827 3727.297363 2
  574.164580 10777.310547 7
  574.216570 1122.112915 1
  575.018099 920.309692 1
  575.166618 1830.077759 1
  576.098127 4954.343750 3
  576.152992 981.291260 1
  577.105233 946.570435 1
  579.106320 939.642456 1
  579.116852 1133.171265 1
  579.285401 2522.216064 2
  579.317012 903.858154 1
  581.027858 21890.230469 13
  581.263427 3488.858887 2
  581.284609 1142.574097 1
  582.228371 1310.033691 1
  583.113242 2125.569824 1
  583.968137 1084.159790 1
  584.322896 1150.259277 1
  585.046753 1007.594971 1
  586.055982 1870.006226 1
  588.896836 1143.067749 1
  589.134505 9346.721680 6
  589.315555 28750.226563 18
  590.319595 5161.923340 3
  590.984048 1142.774658 1
  591.122504 1739.155396 1
  591.146943 840.995239 1
  591.293605 4816.780273 3
  592.074005 1306.090942 1
  592.253688 24983.152344 15
  592.297260 1137.949707 1
  593.259790 3145.763672 2
  594.063235 992.333130 1
  594.230141 1243.486816 1
  595.194645 14019.082031 9
  596.200002 3795.522461 2
  597.001162 4690.860352 3
  597.183093 15582.441406 10
  598.187966 1825.778198 1
  599.159355 2914.845459 2
  600.122001 3879.954590 2
  601.267986 2382.592773 1
  602.098925 1841.065308 1
  603.063072 2733.059814 2
  604.206271 2094.256592 1
  605.271129 1271.565063 1
  606.293674 1102.712891 1
  607.027668 1435.777100 1
  608.230341 1562.111938 1
  611.168486 1751.374146 1
  611.274120 1251.367798 1
  611.296963 22075.472656 14
  612.077255 1206.563232 1
  612.300471 3795.174316 2
  613.142918 1325.224976 1
  613.157261 2563.756348 2
  614.237251 47174.515625 29
  615.239361 5895.644043 4
  616.096551 1137.519531 1
  616.238145 1269.669312 1
  617.175629 1315.264282 1
  617.187216 1285.833984 1
  619.164712 17545.880859 11
  620.170156 1876.910034 1
  620.246028 1633.085815 1
  621.169276 1035.363647 1
  622.106313 22463.796875 14
  623.110118 3881.920898 2
  624.254828 1048.188721 1
  625.057117 1109.492554 1
  626.106552 857.404907 1
  627.271405 973.263306 1
  628.231214 1255.321411 1
  629.115708 1046.610352 1
  629.975184 1446.905151 1
  630.211251 2917.039551 2
  631.117904 1085.795898 1
  633.280192 32223.650391 20
  634.284009 5768.634277 4
  635.138981 2005.333374 1
  635.320469 16656.597656 10
  636.219983 6478.446289 4
  636.280625 977.858398 1
  636.323079 3504.305664 2
  638.079559 3703.208252 2
  638.259263 16682.437500 10
  639.158921 1719.088257 1
  639.262732 3475.250244 2
  641.147944 37717.042969 23
  641.200089 2586.446777 2
  641.276784 1568.792603 1
  642.152087 5821.965332 4
  642.204355 1444.941040 1
  642.262779 1006.252197 1
  644.087161 2462.811279 2
  644.139665 1584.809692 1
  644.216889 1665.860718 1
  648.024157 859.091797 1
  648.108314 1168.756348 1
  649.016389 6449.310547 4
  649.253863 2909.592285 2
  650.255188 1195.661743 1
  654.043499 1189.053589 1
  654.233151 1827.287964 1
  657.122859 4347.295898 3
  657.250178 1063.024536 1
  657.301116 32469.732422 20
  658.305166 6971.416992 4
  658.426445 958.609985 1
  659.279535 1465.377808 1
  659.308319 969.716553 1
  660.243247 19866.505859 12
  661.244411 2362.350098 1
  661.257261 887.929321 1
  662.218876 1943.087036 1
  663.182590 10132.184570 6
  664.989968 1945.004517 1
  665.135785 1084.546265 1
  665.171436 14112.497070 9
  666.177337 945.505127 1
  668.111159 2126.598877 1
  671.050707 932.607788 1
  672.195081 1170.623169 1
  673.273069 1308.822021 1
  676.216886 2138.322998 1
  676.396322 9631.480469 6
  677.404485 1949.444458 1
  679.156645 2149.954346 1
  679.283732 12657.240234 8
  679.337253 4369.726074 3
  680.288302 2676.297363 2
  681.147299 3212.327637 2
  682.223335 24902.314453 15
  682.277203 1725.594604 1
  683.227687 6338.332031 4
  685.161730 1216.832520 1
  687.155040 10614.506836 7
  688.160075 2219.524902 1
  689.157062 1101.965088 1
  690.094563 9341.298828 6
  691.236512 1189.571533 1
  695.018545 1508.339478 1
  695.257467 1121.927124 1
  695.441070 16708.882813 10
  696.443511 5745.674316 4
  698.200390 3239.758301 2
  698.378187 15777.188477 10
  699.383492 3451.791504 2
  701.225181 1054.213745 1
  701.267282 18203.853516 11
  701.319913 6464.532227 4
  702.257738 1146.545166 1
  702.271802 2570.553955 2
  702.321030 1550.621826 1
  703.126990 1529.110962 1
  703.306672 18867.289063 12
  704.206117 2800.401611 2
  704.237893 889.600220 1
  704.259079 2909.995605 2
  704.312047 2219.171387 1
  706.066901 3316.005127 2
  706.247711 12813.757813 8
  707.252295 2054.278809 1
  708.223413 952.524414 1
  708.251901 886.438477 1
  709.103768 981.695923 1
  709.135877 16489.429688 10
  709.185828 2404.304688 1
  709.264333 997.749512 1
  710.139480 1568.710693 1
  712.077693 1428.529175 1
  717.003424 2997.847656 2
  717.242886 2560.984375 2
  717.257402 933.254639 1
  717.420745 9256.166016 6
  718.423803 2392.106201 1
  719.279515 1791.409790 1
  720.359525 12790.356445 8
  721.365095 3438.427979 2
  722.222402 1757.985229 1
  723.301699 7189.163086 4
  724.302389 1532.631470 1
  725.109601 2944.901367 2
  725.253493 863.677002 1
  725.290395 25022.042969 15
  726.295216 4082.782227 3
  727.268776 994.273682 1
  728.229443 7765.275879 5
  729.232939 2310.549805 1
  731.167716 4791.696777 3
  731.350780 885.515625 1
  732.173550 1356.879517 1
  732.978963 1075.608643 1
  733.158958 7990.558105 5
  734.165147 2232.725342 1
  735.135750 1112.848511 1
  736.096960 2674.007813 2
  736.153560 858.542969 1
  738.074289 1511.105103 1
  739.117192 1103.983887 1
  739.402003 6242.310547 4
  741.110523 925.047363 1
  741.263017 3767.986572 2
  741.442257 2455.734619 2
  742.343257 9087.804688 6
  742.450264 1514.887939 1
  743.349273 2471.435547 2
  744.349662 1210.133179 1
  744.384194 10491.821289 6
  745.386674 2228.007568 1
  747.146857 1160.785522 1
  747.270342 7301.689453 4
  747.324376 5578.363281 3
  748.274792 1154.434448 1
  748.328936 1489.686523 1
  749.134042 3197.383301 2
  749.847335 885.323364 1
  750.212128 9399.092773 6
  751.218628 1312.975220 1
  753.401779 990.790405 1
  755.104194 898.313477 1
  755.143398 7100.177246 4
  756.144127 962.681885 1
  756.336652 1153.372437 1
  758.080576 3235.473145 2
  758.317237 1065.512207 1
  761.384097 8344.878906 5
  763.428390 8957.095703 6
  764.325857 1912.696655 1
  764.433660 2932.359619 2
  766.185645 1686.858643 1
  766.365985 14720.353516 9
  767.192353 917.743652 1
  767.369032 2177.844238 1
  769.231883 911.844971 1
  769.256068 11260.179688 7
  769.304442 5143.769531 3
  770.260758 2768.213379 2
  771.113662 1108.604980 1
  771.295745 16648.705078 10
  772.194962 2451.798340 2
  772.247668 1090.565186 1
  772.300379 3379.218262 2
  774.055081 1298.539673 1
  774.234136 11582.476563 7
  774.726858 853.903564 1
  775.240441 2343.499268 1
  777.123860 5353.625000 3
  777.172977 2125.477783 1
  778.123503 1525.464966 1
  778.160411 848.058472 1
  778.180918 968.160034 1
  784.207703 908.038330 1
  785.225207 2039.378540 1
  785.408152 4952.068359 3
  786.411327 1014.456299 1
  787.270338 1355.903931 1
  788.272903 1170.038086 1
  788.352354 3049.993408 2
  788.410905 959.326050 1
  790.208240 1544.255981 1
  791.287910 3459.523438 2
  792.293948 1136.425903 1
  793.095097 2016.996704 1
  793.276578 8305.875000 5
  794.282184 3633.047363 2
  795.251568 1293.016479 1
  795.276990 881.829346 1
  796.218483 6144.583008 4
  796.248197 927.567017 1
  797.221184 1055.446533 1
  799.159710 1061.464111 1
  800.120936 1012.215820 1
  801.148156 7678.274414 5
  802.340494 1143.892578 1
  804.086610 1067.963013 1
  807.392232 1447.720703 1
  809.250552 1278.000854 1
  809.433256 6136.303711 4
  810.330273 5189.182129 3
  811.333559 1653.907104 1
  812.190005 999.253662 1
  812.373705 10879.986328 7
  813.376407 4282.260742 3
  815.259835 4700.624023 3
  815.308214 4361.379395 3
  816.311950 1117.723999 1
  818.201167 6159.938965 4
  818.329412 1083.290039 1
  819.201392 1291.837769 1
  823.131445 1579.404907 1
  824.198839 896.386841 1
  824.458185 911.014160 1
  824.896668 898.899780 1
  826.066174 2846.501221 2
  826.910118 886.459717 1
  827.148272 1040.481445 1
  828.349595 915.295288 1
  829.373005 5491.981934 3
  830.375708 1339.196899 1
  831.235322 1459.194458 1
  831.416464 8213.601563 5
  832.313986 1118.727539 1
  832.418338 1804.193726 1
  833.258405 1121.359253 1
  834.177120 954.765381 1
  834.354671 6011.121094 4
  835.357301 3009.344727 2
  837.244399 6640.370605 4
  837.294748 2405.644287 1
  838.032196 824.665039 1
  838.247659 1789.207153 1
  839.101160 1574.942871 1
  839.284879 16428.056641 10
  840.245792 1203.097046 1
  840.287208 3530.717285 2
  842.223369 8061.282715 5
  842.408114 886.054443 1
  843.184709 925.338013 1
  843.230968 2448.039795 2
  844.226474 1305.291138 1
  845.112332 2961.822510 2
  845.242313 1234.381592 1
  849.216516 883.795654 1
  850.330381 1122.424561 1
  850.508428 1164.483276 1
  851.934818 871.000854 1
  853.397769 4133.197266 3
  853.449582 2235.016113 1
  855.261296 2567.389404 2
  856.155119 1009.507813 1
  856.282922 848.273071 1
  856.334998 1465.338867 1
  857.187830 850.335693 1
  858.198661 1914.292847 1
  859.273141 2887.612793 2
  861.141634 841.760010 1
  861.261005 6584.641602 4
  862.269484 1714.813477 1
  864.200559 1630.044067 1
  868.159542 951.776123 1
  869.131754 2228.162109 1
  869.548224 1276.950317 1
  870.139544 1618.953491 1
  872.072804 1556.614868 1
  872.491390 2761.027832 2
  875.381015 1145.647827 1
  875.429950 1164.953857 1
  877.233596 1310.078125 1
  877.420159 9917.839844 6
  878.319444 3544.182861 2
  878.422729 2018.782349 1
  879.427018 1025.080566 1
  880.359000 10746.998047 7
  881.361668 2797.239990 2
  883.297750 2189.861084 1
  884.305445 1166.394409 1
  886.186443 2463.280518 2
  894.472891 1834.654419 1
  897.360755 2698.606934 2
  898.362093 1016.799805 1
  899.400780 4469.840332 3
  900.303454 1065.907104 1
  900.400432 2089.178467 1
  901.243268 1320.848267 1
  902.338165 5978.192383 4
  905.228213 3175.505127 2
  905.979942 2744.938477 2
  906.237599 971.476318 1
  907.269325 9553.519531 6
  908.271785 1816.358765 1
  910.209056 4953.205078 3
  911.216392 1455.029785 1
  915.555538 1632.089111 1
  915.796346 1068.627930 1
  918.493592 2052.180908 1
  919.209253 916.358765 1
  919.393566 1819.818237 1
  921.382400 1205.192383 1
  921.435242 2884.585205 2
  923.245179 1557.152954 1
  924.290167 963.026733 1
  929.252748 3199.628174 2
  932.192504 1073.828003 1
  932.547503 931.333130 1
  935.384001 1131.121704 1
  937.121383 1081.167114 1
  937.538858 1234.518921 1
  938.434388 2381.414307 1
  939.385594 1053.144043 1
  940.479908 2144.453369 1
  943.369125 1381.645630 1
  944.316881 931.654907 1
  945.408842 9508.186523 6
  946.266177 918.119751 1
  946.304674 1749.190308 1
  946.414680 1898.949097 1
  948.348407 6786.605957 4
  949.353414 1881.935669 1
  952.266993 917.890503 1
  954.046080 987.221924 1
  954.614212 890.735352 1
  965.352840 1688.135376 1
  967.390404 3489.329590 2
  970.199037 971.117676 1
  970.330367 3707.745117 2
  973.220652 1240.662720 1
  973.266542 1274.610718 1
  974.409115 928.357300 1
  975.254419 5602.166016 3
  976.262168 1433.986328 1
  978.201429 2699.284180 2
  980.140677 879.329102 1
  983.546808 2027.904175 1
  986.484681 2898.087402 2
  989.423978 2060.908936 1
  991.231599 1025.017822 1
  992.246504 1123.593384 1
  994.174385 966.251587 1
  1005.529140 1189.291748 1
  1005.975072 10266.775391 6
  1006.421301 1319.971924 1
  1006.976487 2745.627930 2
  1008.463263 1691.396606 1
  1011.404171 980.355225 1
  1013.394277 6724.033691 4
  1014.290826 1440.539795 1
  1014.400689 2579.572998 2
  1016.338432 4149.849609 3
  1017.140824 1044.815186 1
  1017.336973 1360.182007 1
  1019.270843 1473.874023 1
  1022.160395 981.931152 1
  1022.290065 967.038574 1
  1025.465402 1138.464600 1
  1030.440550 1034.174683 1
  1035.376456 2766.982178 2
  1036.283433 1243.251709 1
  1036.384281 1305.284546 1
  1038.315850 1570.755127 1
  1041.255083 1040.353882 1
  1043.244853 2228.153076 1
  1044.251441 1295.486572 1
  1048.484795 908.568970 1
  1048.536110 946.802246 1
  1051.357844 1323.326782 1
  1051.525320 1069.967529 1
  1052.537467 1093.880127 1
  1054.469105 3929.146973 2
  1055.472549 1398.998291 1
  1057.412276 1201.196045 1
  1065.993828 1284.350220 1
  1067.652804 959.678101 1
  1073.523047 1063.770386 1
  1077.454571 1076.159546 1
  1081.387576 5285.316406 3
  1082.389329 1467.293091 1
  1084.316062 3393.501221 2
  1085.963918 944.741089 1
  1096.568148 913.333252 1
  1101.331059 1273.862793 1
  1105.895742 1151.518799 1
  1105.965227 10226.223633 6
  1106.841303 921.721558 1
  1106.980458 1134.740723 1
  1109.727178 924.778809 1
  1111.244334 1184.593018 1
  1117.238336 900.394287 1
  1119.471174 888.130737 1
  1119.506557 840.699951 1
  1120.972907 943.192383 1
  1122.463455 3557.375488 2
  1123.465920 1245.656982 1
  1125.396418 1354.741089 1
  1131.584549 991.156616 1
  1132.210486 930.515869 1
  1142.405947 1032.170410 1
  1149.375320 2329.442139 1
  1150.369831 1629.962280 1
  1152.303604 1343.457642 1
  1159.848817 910.691406 1
  1165.992631 10015.254883 6
  1166.986195 1824.321411 1
  1167.996113 1091.440186 1
  1187.513675 1218.648560 1
  1190.441552 2068.933105 1
  1193.395849 967.596924 1
  1199.887020 1112.756470 1
  1203.168254 1216.520386 1
  1205.964336 4086.806152 3
  1217.792490 939.159546 1
  1223.230201 859.872437 1
  1240.976898 1072.670410 1
  1255.490789 1121.505249 1
  1258.715983 851.604858 1
  1263.411664 936.659790 1
  1265.986349 21714.957031 13
  1266.991162 4894.958984 3
  1267.997171 1770.135376 1
  1269.089790 1017.625732 1
  1305.953675 1076.909668 1
  1333.975324 3299.915039 2
  1337.942289 867.724976 1
  1356.731745 862.997192 1
  1365.984286 15338.017578 9
  1366.976806 2766.489014 2
  1390.331906 907.818115 1
  1404.086550 1029.378906 1
  1405.917321 1039.573608 1
  1433.968021 1847.228149 1
  1435.415652 1093.480225 1
  1435.600614 969.245361 1
  1437.905354 998.757080 1
  1462.634139 898.393555 1
  1465.968841 7457.562500 5
  1466.562870 961.426147 1
  1466.966167 1330.883545 1