ACCESSION: MSBNK-Osaka_Univ-OUF00090
RECORD_TITLE: Acetaminophen glucuronide; GC-EI-TOF; MS; n TMS; RT:1035.611 sec
DATE: 2016.01.19 (Created 2010.05.20, modified 2013.04.24)
AUTHORS: Tsujimoto Y, Tsugawa H, Bamba T, Fukusaki E, engineering department, Osaka Univ.
LICENSE: CC BY-SA
COMMENT: The chemical compound was chemically modified with N-methyl-N-trimethylsilyl-trifluoroacetamide (MSTFA) before GC-MS analysis. When it has two or more functional groups, this modification gave a mixture of the TMS derivatives having different number of TMS groups at different functional groups.

CH$NAME: Acetaminophen glucuronide
CH$COMPOUND_CLASS: Natural Product
CH$FORMULA: C14H17NO8
CH$EXACT_MASS: 327.09542
CH$SMILES: CC(=O)Nc(c2)ccc(c2)OC(O1)C(O)C(O)C(O)C(C(O)=O)1
CH$IUPAC: InChI=1S/C14H17NO8/c1-6(16)15-7-2-4-8(5-3-7)22-14-11(19)9(17)10(18)12(23-14)13(20)21/h2-5,9-12,14,17-19H,1H3,(H,15,16)(H,20,21)/t9-,10-,11+,12-,14+/m0/s1
CH$LINK: CAS 16110-10-4
CH$LINK: CHEBI 32636
CH$LINK: CHEMSPIDER 75744
CH$LINK: PUBCHEM CID:83944
CH$LINK: INCHIKEY IPROLSVTVHAQLE-BYNIDDHOSA-N
CH$LINK: COMPTOX DTXSID30936449

AC$INSTRUMENT: Pegasus III TOF-MS system, Leco; GC 6890, Agilent Technologies
AC$INSTRUMENT_TYPE: GC-EI-TOF
AC$MASS_SPECTROMETRY: MS_TYPE MS
AC$MASS_SPECTROMETRY: ION_MODE POSITIVE
AC$MASS_SPECTROMETRY: HELIUM_FLOW 1 ml/min
AC$MASS_SPECTROMETRY: ION_SOURCE_TEMPERATURE 200 C
AC$MASS_SPECTROMETRY: SCAN_RANGE_M/Z 85-500
AC$CHROMATOGRAPHY: COLUMN_NAME CP-SIL 8 CB LOW BLEED/MS
AC$CHROMATOGRAPHY: INJECTION_TEMPERATURE 230 C
AC$CHROMATOGRAPHY: OVEN_TEMPERATURE 80 C (Duration 2 min)-330 C (rate: 15 C/min; Duration 6 min)
AC$CHROMATOGRAPHY: RETENTION_INDEX 2805.866
AC$CHROMATOGRAPHY: RETENTION_TIME 1035.611 sec
AC$CHROMATOGRAPHY: TRANSFARLINE_TEMPERATURE 250 C

MS$DATA_PROCESSING: WHOLE ChromaTOF ver. 2.32 (LECO)

PK$SPLASH: splash10-00kb-0961000000-dcaaa03ec12ac3e8bc7b
PK$NUM_PEAK: 303
PK$PEAK: m/z int. rel.int.
  85 26 26
  86 13 13
  87 19 19
  88 7 7
  89 30 30
  90 15 15
  91 43 43
  92 15 15
  93 48 48
  94 9 9
  95 37 37
  96 10 10
  97 17 17
  98 7 7
  99 39 39
  100 14 14
  101 64 64
  102 17 17
  103 123 123
  104 25 25
  105 78 78
  106 16 16
  107 16 16
  108 31 31
  109 24 24
  110 5 5
  111 22 22
  112 5 5
  113 21 21
  114 43 43
  115 55 55
  116 396 396
  117 146 146
  118 43 43
  119 31 31
  120 11 11
  121 11 11
  122 4 4
  123 20 20
  124 3 3
  125 13 13
  126 4 4
  127 20 20
  128 7 7
  129 249 249
  130 37 37
  131 104 104
  132 28 28
  133 288 288
  134 380 380
  135 78 78
  136 16 16
  137 13 13
  138 3 3
  139 4 4
  140 5 5
  141 30 30
  142 16 16
  143 249 249
  144 40 40
  145 28 28
  146 30 30
  147 999 999
  148 170 170
  149 144 144
  150 32 32
  151 28 28
  152 12 12
  153 39 39
  154 9 9
  155 8 8
  156 8 8
  157 34 34
  158 17 17
  159 15 15
  160 7 7
  161 13 13
  162 49 49
  163 33 33
  164 23 23
  165 44 44
  166 20 20
  167 12 12
  168 5 5
  169 591 591
  170 89 89
  171 63 63
  172 12 12
  173 13 13
  174 13 13
  175 14 14
  176 11 11
  177 12 12
  178 11 11
  179 15 15
  180 68 68
  181 37 37
  182 12 12
  183 12 12
  184 6 6
  185 33 33
  186 12 12
  187 9 9
  188 14 14
  189 66 66
  190 30 30
  191 66 66
  192 37 37
  193 17 17
  194 7 7
  195 7 7
  196 2 2
  197 8 8
  198 4 4
  199 3 3
  200 3 3
  201 8 8
  202 5 5
  203 14 14
  204 101 101
  205 34 34
  206 131 131
  207 88 88
  208 185 185
  209 41 41
  210 15 15
  211 4 4
  212 3 3
  213 7 7
  214 3 3
  215 15 15
  216 7 7
  217 374 374
  218 86 86
  219 57 57
  220 26 26
  221 37 37
  222 176 176
  223 189 189
  224 41 41
  225 13 13
  226 2 2
  227 2 2
  228 4 4
  229 21 21
  230 9 9
  231 29 29
  232 30 30
  233 13 13
  234 13 13
  235 4 4
  236 25 25
  237 14 14
  238 6 6
  239 4 4
  240 1 1
  241 24 24
  242 8 8
  243 54 54
  244 16 16
  245 25 25
  246 9 9
  247 5 5
  248 37 37
  249 11 11
  250 9 9
  251 4 4
  252 3 3
  253 2 2
  254 9 9
  255 5 5
  256 6 6
  257 196 196
  258 53 53
  259 31 31
  260 29 29
  261 11 11
  262 9 9
  263 2 2
  264 4 4
  265 4 4
  266 3 3
  267 2 2
  269 1 1
  270 1 1
  271 2 2
  272 2 2
  273 1 1
  274 2 2
  275 3 3
  276 4 4
  277 3 3
  278 5 5
  279 10 10
  280 120 120
  281 73 73
  282 27 27
  283 8 8
  284 3 3
  285 33 33
  286 14 14
  287 10 10
  288 5 5
  289 3 3
  290 3 3
  291 11 11
  292 5 5
  293 5 5
  294 28 28
  295 834 834
  296 255 255
  297 99 99
  298 22 22
  299 5 5
  300 3 3
  301 1 1
  302 2 2
  303 4 4
  304 3 3
  305 45 45
  306 19 19
  307 10 10
  308 7 7
  309 2 2
  310 1 1
  311 1 1
  312 1 1
  315 1 1
  317 3 3
  318 3 3
  319 19 19
  320 10 10
  321 6 6
  322 16 16
  323 7 7
  324 6 6
  325 1 1
  326 1 1
  328 2 2
  330 1 1
  331 28 28
  332 16 16
  333 44 44
  334 21 21
  335 20 20
  336 11 11
  337 6 6
  338 10 10
  339 4 4
  340 1 1
  344 1 1
  345 7 7
  346 6 6
  347 21 21
  348 13 13
  349 6 6
  350 4 4
  351 2 2
  352 1 1
  354 1 1
  358 1 1
  359 5 5
  360 3 3
  361 2 2
  362 5 5
  363 1 1
  366 1 1
  373 1 1
  374 22 22
  375 270 270
  376 117 117
  377 53 53
  378 18 18
  379 4 4
  380 1 1
  390 2 2
  391 1 1
  392 1 1
  393 1 1
  394 1 1
  402 1 1
  404 1 1
  407 1 1
  410 3 3
  411 1 1
  418 1 1
  420 1 1
  421 1 1
  422 1 1
  424 2 2
  439 1 1
  448 1 1
  449 2 2
  450 1 1
  463 5 5
  464 27 27
  465 19 19
  466 10 10
  467 4 4
  490 4 4
  491 2 2
  492 5 5
  493 3 3