ACCESSION: MSBNK-PFOS_research_group-FFF00138
RECORD_TITLE: 5-beta-Androstan-17-beta-ol-3-one; LC-APPI-QQ; MS2; CE:60 V; [M-H2O+H]+
DATE: 2016.01.19 (Created 2011.04.04, modified 2011.06.20)
AUTHORS: Atsushi Yamamoto, PFOS.jp
LICENSE: CC BY-SA
COPYRIGHT: PFOS.jp
COMMENT: Disclaimer: While authors make an effort to ensure that the content of this record is accurate, the authors make no representations or warranties in relation to the accuracy or completeness of the record. This record do not reflect any viewpoints of the affiliation and organization to which the authors belong.

CH$NAME: 5-beta-Androstan-17-beta-ol-3-one
CH$NAME: 5-beta-Dihydrotestosterone
CH$NAME: Etiocholane-17-beta-ol-3-one
CH$COMPOUND_CLASS: Natural Product; Steroid hormone
CH$FORMULA: C19H30O2
CH$EXACT_MASS: 290.22458
CH$SMILES: O=C(C4)CC([H])(C3)C(C)(C4)C(C2)C(C3)C(C1)C(C)(C2)C(O)C1
CH$IUPAC: InChI=1S/C19H30O2/c1-18-9-7-13(20)11-12(18)3-4-14-15-5-6-17(21)19(15,2)10-8-16(14)18/h12,14-17,21H,3-11H2,1-2H3/t12-,14?,15?,16?,17+,18?,19?/m1/s1
CH$LINK: CAS 571-22-2
CH$LINK: INCHIKEY NVKAWKQGWWIWPM-NOLKSFPRSA-N

AC$INSTRUMENT: API2000
AC$INSTRUMENT_TYPE: LC-APPI-QQ
AC$MASS_SPECTROMETRY: MS_TYPE MS2
AC$MASS_SPECTROMETRY: ION_MODE POSITIVE
AC$CHROMATOGRAPHY: RETENTION_TIME 0.820833 min

MS$FOCUSED_ION: BASE_PEAK 105.099998
MS$FOCUSED_ION: PRECURSOR_M/Z 273.100000
MS$FOCUSED_ION: PRECURSOR_TYPE [M-H2O+H]+

PK$SPLASH: splash10-054o-9400000000-eba4157d45d0225bbf69
PK$NUM_PEAK: 274
PK$PEAK: m/z int. rel.int.
  38.900002 3701.000000 1
  39.099998 9252.500000 2
  40.000000 11103.000000 2
  41.160377 196153.000000 35
  42.299999 18505.000000 3
  43.080000 222060.000000 40
  44.500000 3701.000000 1
  44.799999 1850.500000 1
  45.099998 1850.500000 1
  48.200001 1850.500000 1
  50.400002 5551.500000 1
  50.599998 1850.500000 1
  50.799999 1850.500000 1
  51.000000 3701.000000 1
  51.700001 1850.500000 1
  52.000000 3701.000000 1
  52.200001 3701.000000 1
  53.114286 129535.000000 23
  55.114591 1471147.500000 264
  56.058332 22206.000000 4
  57.163265 90674.500000 16
  58.650000 3701.000000 1
  59.000000 1850.500000 1
  59.400002 3701.000000 1
  63.233334 11103.000000 2
  63.599998 1850.500000 1
  63.850000 3701.000000 1
  65.170770 240565.000000 43
  67.127190 3042222.000000 545
  69.055294 314585.000000 56
  70.350002 7402.000000 1
  71.124998 14804.000000 3
  72.199997 1850.500000 1
  73.300003 1850.500000 1
  74.099998 1850.500000 1
  75.000000 3701.000000 1
  75.972223 33309.000000 6
  77.070629 2413052.000000 432
  79.044074 4387535.500000 786
  81.118975 3179159.000000 570
  82.099998 12953.500000 2
  83.085937 118432.000000 21
  84.300003 1850.500000 1
  85.099998 9252.500000 2
  85.350002 3701.000000 1
  88.699997 3701.000000 1
  91.050083 5575556.500000 999
  93.111694 3101438.000000 556
  95.087408 1763526.500000 316
  96.099998 5551.500000 1
  97.116363 203555.000000 36
  97.916668 11103.000000 2
  98.400002 1850.500000 1
  98.900002 5551.500000 1
  101.000000 3701.000000 1
  101.400002 3701.000000 1
  101.800003 7402.000000 1
  103.031147 225761.000000 40
  105.077918 3519651.000000 631
  107.059302 636572.000000 114
  109.076577 205405.500000 37
  110.049999 3701.000000 1
  110.425001 7402.000000 1
  111.000000 11103.000000 2
  111.300003 5551.500000 1
  112.599998 1850.500000 1
  112.900002 1850.500000 1
  113.300003 1850.500000 1
  113.639998 9252.500000 2
  115.043805 418213.000000 75
  117.125686 943755.000000 169
  119.121428 984466.000000 176
  120.399999 25907.000000 5
  121.032468 142488.500000 26
  121.950001 3701.000000 1
  122.971429 51814.000000 9
  124.099998 1850.500000 1
  125.300003 5551.500000 1
  125.599998 1850.500000 1
  127.090475 77721.000000 14
  128.103630 458924.000000 82
  129.098887 997419.500000 179
  130.149106 414512.000000 74
  131.155193 623618.500000 112
  131.883329 11103.000000 2
  133.155385 240565.000000 43
  133.800003 1850.500000 1
  134.500000 9252.500000 2
  135.131580 70319.000000 13
  135.600006 1850.500000 1
  135.899994 1850.500000 1
  136.800003 3701.000000 1
  137.300003 5551.500000 1
  137.600006 1850.500000 1
  139.000000 1850.500000 1
  139.199997 5551.500000 1
  140.139999 9252.500000 2
  141.183332 66618.000000 12
  142.127160 299781.000000 54
  143.116114 390455.500000 70
  144.127777 199854.000000 36
  145.155386 360847.500000 65
  146.229999 18505.000000 3
  147.173079 96226.000000 17
  147.899994 1850.500000 1
  148.300003 1850.500000 1
  148.899994 3701.000000 1
  149.174999 7402.000000 1
  149.899994 1850.500000 1
  150.199997 1850.500000 1
  150.750000 3701.000000 1
  151.000000 1850.500000 1
  151.199997 1850.500000 1
  151.650002 3701.000000 1
  152.100003 24056.500000 4
  152.800003 9252.500000 2
  153.150002 14804.000000 3
  153.474998 7402.000000 1
  153.699997 7402.000000 1
  154.200002 33309.000000 6
  155.100000 109179.500000 20
  156.160608 61066.500000 11
  157.198811 155442.000000 28
  158.000000 14804.000000 3
  158.312502 14804.000000 3
  159.222581 114731.000000 21
  160.000000 1850.500000 1
  160.199997 5551.500000 1
  160.600001 5551.500000 1
  161.080005 18505.000000 3
  162.899994 12953.500000 2
  163.300003 3701.000000 1
  163.600006 1850.500000 1
  163.899994 3701.000000 1
  164.100006 1850.500000 1
  164.750000 14804.000000 3
  165.271428 12953.500000 2
  166.399999 5551.500000 1
  167.266668 11103.000000 2
  167.916662 11103.000000 2
  169.348148 49963.500000 9
  170.166668 33309.000000 6
  171.087502 59216.000000 11
  171.800003 5551.500000 1
  172.399994 1850.500000 1
  172.774998 14804.000000 3
  173.339999 18505.000000 3
  173.899994 1850.500000 1
  174.699997 1850.500000 1
  175.099998 7402.000000 1
  175.399994 1850.500000 1
  175.699997 3701.000000 1
  175.924995 7402.000000 1
  176.300003 5551.500000 1
  177.199997 1850.500000 1
  177.924995 7402.000000 1
  178.199997 7402.000000 1
  178.399994 1850.500000 1
  178.600006 1850.500000 1
  178.899994 1850.500000 1
  179.300003 1850.500000 1
  180.150002 3701.000000 1
  180.500000 1850.500000 1
  180.699997 1850.500000 1
  180.899994 1850.500000 1
  181.433334 11103.000000 2
  182.100001 11103.000000 2
  182.939999 18505.000000 3
  183.300000 27757.500000 5
  184.436364 20355.500000 4
  185.246154 48113.000000 9
  186.000000 3701.000000 1
  186.399994 1850.500000 1
  187.257145 25907.000000 5
  188.180955 38860.500000 7
  188.962498 118432.000000 21
  190.000000 5551.500000 1
  190.550003 3701.000000 1
  190.800003 3701.000000 1
  191.199997 1850.500000 1
  191.399994 1850.500000 1
  192.500000 1850.500000 1
  192.949997 3701.000000 1
  194.399994 1850.500000 1
  195.300003 1850.500000 1
  195.699997 1850.500000 1
  195.899994 1850.500000 1
  196.150002 3701.000000 1
  197.175001 44412.000000 8
  198.000000 3701.000000 1
  199.200004 27757.500000 5
  201.200001 99927.000000 18
  202.134396 521841.000000 94
  202.699997 3701.000000 1
  203.100006 3701.000000 1
  203.325001 7402.000000 1
  203.899994 1850.500000 1
  204.100006 1850.500000 1
  204.349998 3701.000000 1
  205.050003 3701.000000 1
  205.500000 1850.500000 1
  209.100006 1850.500000 1
  209.500000 1850.500000 1
  210.199997 3701.000000 1
  210.399994 1850.500000 1
  210.750000 3701.000000 1
  211.000000 9252.500000 2
  211.237499 14804.000000 3
  211.600006 3701.000000 1
  212.050003 3701.000000 1
  212.500000 5551.500000 1
  213.135715 51814.000000 9
  213.957140 25907.000000 5
  215.147897 351595.000000 63
  215.949997 22206.000000 4
  216.399994 3701.000000 1
  216.799998 5551.500000 1
  217.274998 14804.000000 3
  217.899994 1850.500000 1
  218.600006 1850.500000 1
  222.699997 1850.500000 1
  223.250000 3701.000000 1
  223.899994 3701.000000 1
  224.600006 7402.000000 1
  224.929996 18505.000000 3
  225.300001 12953.500000 2
  226.192984 105478.500000 19
  226.928569 12953.500000 2
  227.199997 9252.500000 2
  227.399994 9252.500000 2
  227.674999 7402.000000 1
  228.188889 33309.000000 6
  229.300003 18505.000000 3
  229.825001 7402.000000 1
  230.200003 18505.000000 3
  230.699997 3701.000000 1
  231.399994 1850.500000 1
  232.500000 1850.500000 1
  237.050003 3701.000000 1
  237.300003 1850.500000 1
  238.100006 1850.500000 1
  238.300003 1850.500000 1
  238.899994 7402.000000 1
  239.199997 11103.000000 2
  239.399994 12953.500000 2
  239.899999 5551.500000 1
  240.899994 5551.500000 1
  241.300003 1850.500000 1
  241.500000 1850.500000 1
  241.699997 1850.500000 1
  242.183332 11103.000000 2
  242.899994 9252.500000 2
  243.399994 11103.000000 2
  243.899994 5551.500000 1
  244.250000 11103.000000 2
  245.000000 12953.500000 2
  245.399994 1850.500000 1
  245.600006 1850.500000 1
  252.000000 1850.500000 1
  252.300003 1850.500000 1
  253.699997 1850.500000 1
  255.000000 1850.500000 1
  255.449997 7402.000000 1
  256.100006 1850.500000 1
  256.299988 1850.500000 1
  257.000000 5551.500000 1
  257.500000 5551.500000 1
  258.000000 1850.500000 1
  262.100006 1850.500000 1
  270.650009 3701.000000 1
  271.000000 1850.500000 1
  271.600006 1850.500000 1
  272.949997 3701.000000 1
  273.500000 1850.500000 1