ACCESSION: MSBNK-PFOS_research_group-FFF00140
RECORD_TITLE: 5-beta-Androstan-17-beta-ol-3-one; LC-APPI-QQ; MS2; CE:40 V; [M-H2O+H]+
DATE: 2016.01.19 (Created 2011.04.04, modified 2011.06.20)
AUTHORS: Atsushi Yamamoto, PFOS.jp
LICENSE: CC BY-SA
COPYRIGHT: PFOS.jp
COMMENT: Disclaimer: While authors make an effort to ensure that the content of this record is accurate, the authors make no representations or warranties in relation to the accuracy or completeness of the record. This record do not reflect any viewpoints of the affiliation and organization to which the authors belong.

CH$NAME: 5-beta-Androstan-17-beta-ol-3-one
CH$NAME: 5-beta-Dihydrotestosterone
CH$NAME: Etiocholane-17-beta-ol-3-one
CH$COMPOUND_CLASS: Natural Product; Steroid hormone
CH$FORMULA: C19H30O2
CH$EXACT_MASS: 290.22458
CH$SMILES: O=C(C4)CC([H])(C3)C(C)(C4)C(C2)C(C3)C(C1)C(C)(C2)C(O)C1
CH$IUPAC: InChI=1S/C19H30O2/c1-18-9-7-13(20)11-12(18)3-4-14-15-5-6-17(21)19(15,2)10-8-16(14)18/h12,14-17,21H,3-11H2,1-2H3/t12-,14?,15?,16?,17+,18?,19?/m1/s1
CH$LINK: CAS 571-22-2
CH$LINK: INCHIKEY NVKAWKQGWWIWPM-NOLKSFPRSA-N

AC$INSTRUMENT: API2000
AC$INSTRUMENT_TYPE: LC-APPI-QQ
AC$MASS_SPECTROMETRY: MS_TYPE MS2
AC$MASS_SPECTROMETRY: ION_MODE POSITIVE
AC$CHROMATOGRAPHY: RETENTION_TIME 0.820867 min

MS$FOCUSED_ION: BASE_PEAK 93.199997
MS$FOCUSED_ION: PRECURSOR_M/Z 273.100000
MS$FOCUSED_ION: PRECURSOR_TYPE [M-H2O+H]+

PK$SPLASH: splash10-052e-5910000000-8521aefa1e7b18515739
PK$NUM_PEAK: 251
PK$PEAK: m/z int. rel.int.
  37.700001 1850.500000 1
  38.900002 1850.500000 1
  41.000000 18505.000000 4
  41.400002 7402.000000 2
  41.599998 1850.500000 1
  41.900002 1850.500000 1
  42.099998 1850.500000 1
  43.181818 40711.000000 10
  44.500000 1850.500000 1
  49.700001 1850.500000 1
  51.099998 1850.500000 1
  52.799999 1850.500000 1
  53.400002 5551.500000 1
  53.799999 5551.500000 1
  54.299999 11103.000000 3
  55.075581 318286.000000 77
  56.099998 1850.500000 1
  57.113158 140638.000000 34
  57.900002 1850.500000 1
  59.400002 1850.500000 1
  61.799999 1850.500000 1
  64.500000 1850.500000 1
  65.000000 9252.500000 2
  67.109943 1302752.000000 314
  69.094737 421914.000000 102
  70.074999 7402.000000 2
  70.400002 3701.000000 1
  71.081249 29608.000000 7
  72.950001 3701.000000 1
  73.250000 3701.000000 1
  74.199997 1850.500000 1
  75.699997 1850.500000 1
  76.283335 11103.000000 3
  77.155881 125834.000000 30
  79.045071 1839397.000000 444
  81.133104 3219870.000000 777
  83.147726 244266.000000 59
  84.100000 9252.500000 2
  84.500000 1850.500000 1
  84.926668 27757.500000 7
  85.235713 25907.000000 6
  87.699997 1850.500000 1
  88.450001 7402.000000 2
  88.800003 1850.500000 1
  89.666664 16654.500000 4
  91.057404 1824593.000000 440
  93.125660 4139568.500000 999
  95.061935 3558511.500000 859
  97.069231 360847.500000 87
  97.800003 3701.000000 1
  98.400002 7402.000000 2
  98.599998 1850.500000 1
  99.099998 11103.000000 3
  99.300003 9252.500000 2
  101.099998 1850.500000 1
  102.199997 3701.000000 1
  103.193747 29608.000000 7
  105.089526 3391966.500000 819
  107.039673 1809789.000000 437
  107.900002 12953.500000 3
  109.106944 1332360.000000 322
  110.583332 11103.000000 3
  111.165218 85123.000000 21
  111.800003 1850.500000 1
  112.400002 1850.500000 1
  113.199997 3701.000000 1
  113.500000 3701.000000 1
  113.900002 1850.500000 1
  115.037036 49963.500000 12
  117.092452 588459.000000 142
  119.102800 1387875.000000 335
  121.104283 1123253.500000 271
  123.084153 677283.000000 163
  123.900002 3701.000000 1
  124.200001 7402.000000 2
  124.866669 11103.000000 3
  125.400002 9252.500000 2
  125.800003 3701.000000 1
  126.400002 1850.500000 1
  127.199997 9252.500000 2
  128.035299 31458.500000 8
  129.074027 284977.000000 69
  131.188791 1254639.000000 303
  133.166802 1376772.000000 332
  135.118512 919698.500000 222
  137.000000 33309.000000 8
  138.100006 1850.500000 1
  138.500000 1850.500000 1
  139.000000 1850.500000 1
  139.250000 7402.000000 2
  140.000000 1850.500000 1
  140.399994 1850.500000 1
  140.600006 1850.500000 1
  140.849998 11103.000000 3
  141.500002 18505.000000 4
  143.108634 514439.000000 124
  145.116036 2054055.000000 496
  147.151445 2305723.000000 556
  148.081822 20355.500000 5
  148.399994 16654.500000 4
  149.151471 251668.000000 61
  149.800003 11103.000000 3
  150.000000 3701.000000 1
  150.699997 7402.000000 2
  151.123531 31458.500000 8
  151.399994 9252.500000 2
  152.100006 1850.500000 1
  152.600006 1850.500000 1
  153.349998 7402.000000 2
  153.600006 3701.000000 1
  153.949997 3701.000000 1
  154.199997 1850.500000 1
  154.449997 7402.000000 2
  155.300003 18505.000000 4
  155.562504 14804.000000 4
  155.800003 9252.500000 2
  156.090005 18505.000000 4
  157.186238 403409.000000 97
  159.142265 2189141.500000 528
  161.157808 1469297.000000 355
  161.899994 18505.000000 4
  162.279999 18505.000000 4
  163.240000 203555.000000 49
  163.800003 3701.000000 1
  164.100006 1850.500000 1
  164.300003 3701.000000 1
  164.600006 1850.500000 1
  164.800003 1850.500000 1
  165.000000 9252.500000 2
  165.699997 1850.500000 1
  166.100006 1850.500000 1
  166.600006 1850.500000 1
  166.800003 3701.000000 1
  167.200002 11103.000000 3
  167.699997 1850.500000 1
  167.899994 3701.000000 1
  168.300003 3701.000000 1
  168.699997 9252.500000 2
  169.000000 16654.500000 4
  169.327272 40711.000000 10
  169.984614 24056.500000 6
  171.104236 436718.000000 105
  173.202743 877137.000000 212
  173.800003 9252.500000 2
  174.000000 5551.500000 1
  174.199997 1850.500000 1
  174.600006 14804.000000 4
  175.177551 181349.000000 44
  175.899994 3701.000000 1
  176.349998 7402.000000 2
  177.111905 77721.000000 19
  177.699997 5551.500000 1
  178.100006 5551.500000 1
  179.166667 11103.000000 3
  180.100006 1850.500000 1
  180.399994 1850.500000 1
  180.600006 1850.500000 1
  181.000000 3701.000000 1
  181.199997 1850.500000 1
  181.399994 3701.000000 1
  181.800003 5551.500000 1
  182.199997 5551.500000 1
  182.800003 12953.500000 3
  183.000000 16654.500000 4
  183.318182 20355.500000 5
  185.155435 680984.000000 164
  186.228945 70319.000000 17
  187.253210 201704.500000 49
  188.258334 22206.000000 5
  189.135000 222060.000000 54
  190.100006 3701.000000 1
  190.300003 1850.500000 1
  191.399994 11103.000000 3
  194.849998 3701.000000 1
  195.300003 3701.000000 1
  195.800003 3701.000000 1
  196.988888 33309.000000 8
  197.899994 9252.500000 2
  198.470587 31458.500000 8
  199.212500 740200.000000 179
  201.192475 172096.500000 42
  202.146298 299781.000000 72
  202.883329 11103.000000 3
  203.344440 33309.000000 8
  204.300003 1850.500000 1
  204.500000 1850.500000 1
  205.100006 3701.000000 1
  205.300003 5551.500000 1
  205.699997 1850.500000 1
  207.349998 3701.000000 1
  208.300003 3701.000000 1
  208.899994 1850.500000 1
  209.349998 3701.000000 1
  211.213334 55515.000000 13
  212.260001 18505.000000 4
  213.180247 299781.000000 72
  215.091194 294229.500000 71
  216.100000 59216.000000 14
  217.000000 48113.000000 12
  217.303172 116581.500000 28
  217.899994 1850.500000 1
  218.199997 3701.000000 1
  218.550003 7402.000000 2
  218.949997 3701.000000 1
  219.250000 3701.000000 1
  219.500000 1850.500000 1
  224.100006 3701.000000 1
  224.300003 1850.500000 1
  224.500000 3701.000000 1
  224.800003 5551.500000 1
  225.318180 40711.000000 10
  226.156818 162844.000000 39
  227.262337 142488.500000 34
  228.312502 14804.000000 4
  229.275002 44412.000000 11
  230.040911 81422.000000 20
  231.028573 12953.500000 3
  231.300003 1850.500000 1
  231.600006 1850.500000 1
  232.050003 3701.000000 1
  233.000000 3701.000000 1
  236.699997 1850.500000 1
  238.100006 1850.500000 1
  238.500000 1850.500000 1
  238.800003 5551.500000 1
  239.300003 12953.500000 3
  240.000000 18505.000000 4
  240.366665 66618.000000 16
  240.949997 22206.000000 5
  241.355555 16654.500000 4
  242.271430 25907.000000 6
  243.290002 18505.000000 4
  244.238460 24056.500000 6
  245.250002 170246.000000 41
  247.199997 1850.500000 1
  251.399994 1850.500000 1
  252.000000 1850.500000 1
  253.199997 5551.500000 1
  254.000000 3701.000000 1
  255.308056 1056635.500000 255
  256.250000 22206.000000 5
  257.000000 12953.500000 3
  258.339581 88824.000000 21
  269.700012 1850.500000 1
  271.028573 12953.500000 3
  271.299988 7402.000000 2
  271.600006 5551.500000 1
  272.000000 5551.500000 1
  272.237503 14804.000000 4
  273.226835 151741.000000 37
  351.000000 1850.500000 1