ACCESSION: MSBNK-PFOS_research_group-FFF00141
RECORD_TITLE: 5-beta-Androstan-17-beta-ol-3-one; LC-APPI-QQ; MS2; CE:30 V; [M-H2O+H]+
DATE: 2016.01.19 (Created 2011.04.04, modified 2011.06.20)
AUTHORS: Atsushi Yamamoto, PFOS.jp
LICENSE: CC BY-SA
COPYRIGHT: PFOS.jp
COMMENT: Disclaimer: While authors make an effort to ensure that the content of this record is accurate, the authors make no representations or warranties in relation to the accuracy or completeness of the record. This record do not reflect any viewpoints of the affiliation and organization to which the authors belong.

CH$NAME: 5-beta-Androstan-17-beta-ol-3-one
CH$NAME: 5-beta-Dihydrotestosterone
CH$NAME: Etiocholane-17-beta-ol-3-one
CH$COMPOUND_CLASS: Natural Product; Steroid hormone
CH$FORMULA: C19H30O2
CH$EXACT_MASS: 290.22458
CH$SMILES: O=C(C4)CC([H])(C3)C(C)(C4)C(C2)C(C3)C(C1)C(C)(C2)C(O)C1
CH$IUPAC: InChI=1S/C19H30O2/c1-18-9-7-13(20)11-12(18)3-4-14-15-5-6-17(21)19(15,2)10-8-16(14)18/h12,14-17,21H,3-11H2,1-2H3/t12-,14?,15?,16?,17+,18?,19?/m1/s1
CH$LINK: CAS 571-22-2
CH$LINK: INCHIKEY NVKAWKQGWWIWPM-NOLKSFPRSA-N

AC$INSTRUMENT: API2000
AC$INSTRUMENT_TYPE: LC-APPI-QQ
AC$MASS_SPECTROMETRY: MS_TYPE MS2
AC$MASS_SPECTROMETRY: ION_MODE POSITIVE
AC$CHROMATOGRAPHY: RETENTION_TIME 0.820850 min

MS$FOCUSED_ION: BASE_PEAK 255.300003
MS$FOCUSED_ION: PRECURSOR_M/Z 273.100000
MS$FOCUSED_ION: PRECURSOR_TYPE [M-H2O+H]+

PK$SPLASH: splash10-0a4j-1940000000-bb6218fc28fdea58aeb9
PK$NUM_PEAK: 250
PK$PEAK: m/z int. rel.int.
  38.700001 1850.500000 1
  41.049999 7402.000000 1
  41.299999 1850.500000 1
  42.200001 1850.500000 1
  42.650000 3701.000000 1
  42.966667 11103.000000 1
  43.299999 9252.500000 1
  43.900002 1850.500000 1
  45.400002 1850.500000 1
  52.900002 1850.500000 1
  53.200001 1850.500000 1
  54.099998 1850.500000 1
  54.350000 7402.000000 1
  54.599998 3701.000000 1
  55.163636 40711.000000 4
  55.599998 1850.500000 1
  55.799999 3701.000000 1
  57.241177 62917.000000 7
  58.700001 5551.500000 1
  59.000000 1850.500000 1
  59.200001 1850.500000 1
  64.850002 3701.000000 1
  65.300003 1850.500000 1
  66.099998 5551.500000 1
  67.099438 329389.000000 36
  68.000000 9252.500000 1
  68.483334 11103.000000 1
  69.208162 90674.500000 10
  69.900002 3701.000000 1
  70.099998 3701.000000 1
  70.500000 3701.000000 1
  70.900002 5551.500000 1
  71.199997 7402.000000 1
  71.500000 1850.500000 1
  73.099998 1850.500000 1
  73.300003 1850.500000 1
  74.800003 1850.500000 1
  77.000000 18505.000000 2
  77.816669 11103.000000 1
  79.028333 444120.000000 48
  81.050433 1284247.000000 139
  83.131034 214658.000000 23
  83.900002 5551.500000 1
  84.199997 1850.500000 1
  84.400002 7402.000000 1
  84.926668 27757.500000 3
  85.309524 38860.500000 4
  87.300003 1850.500000 1
  89.000000 3701.000000 1
  89.699997 7402.000000 1
  91.050000 540346.000000 58
  93.098601 1587729.000000 171
  95.050509 2183590.000000 236
  96.000000 11103.000000 1
  96.400002 18505.000000 2
  97.083710 408960.500000 44
  98.500000 7402.000000 1
  98.925001 7402.000000 1
  99.250000 14804.000000 2
  99.599998 1850.500000 1
  100.500000 1850.500000 1
  102.400002 3701.000000 1
  103.039999 9252.500000 1
  103.900002 14804.000000 2
  105.095775 1313855.000000 142
  107.046232 1817191.000000 196
  107.878573 25907.000000 3
  109.121936 1720965.000000 186
  110.000000 20355.500000 2
  111.192857 103628.000000 11
  112.500000 1850.500000 1
  112.699997 1850.500000 1
  112.900002 1850.500000 1
  113.099998 1850.500000 1
  113.400002 1850.500000 1
  113.900002 1850.500000 1
  115.000000 9252.500000 1
  115.300003 3701.000000 1
  117.087179 288678.000000 31
  117.800003 18505.000000 2
  118.064285 25907.000000 3
  119.080544 884539.000000 95
  121.134596 1807938.500000 195
  123.070098 1132506.000000 122
  123.875002 7402.000000 1
  124.099998 5551.500000 1
  124.800003 9252.500000 1
  125.199998 27757.500000 3
  127.049999 3701.000000 1
  127.800003 1850.500000 1
  128.000000 7402.000000 1
  128.399994 5551.500000 1
  129.150982 94375.500000 10
  130.200003 53664.500000 6
  131.146530 906745.000000 98
  133.143456 1328659.000000 143
  135.139301 1746872.000000 188
  136.199997 5551.500000 1
  137.243809 194302.500000 21
  137.800003 3701.000000 1
  138.889475 35159.500000 4
  139.400000 18505.000000 2
  140.799998 5551.500000 1
  141.349998 3701.000000 1
  143.074603 233163.000000 25
  145.115481 2366789.500000 255
  147.142405 3386415.000000 365
  149.179629 599562.000000 65
  150.050003 3701.000000 1
  150.995454 40711.000000 4
  152.399999 5551.500000 1
  152.899994 3701.000000 1
  153.199997 7402.000000 1
  154.000000 1850.500000 1
  154.699997 3701.000000 1
  155.000000 1850.500000 1
  155.300003 3701.000000 1
  155.600006 1850.500000 1
  155.899994 3701.000000 1
  156.100006 7402.000000 1
  156.462498 14804.000000 2
  157.123225 286827.500000 31
  159.165180 3693598.000000 398
  161.157142 2409351.000000 260
  162.100006 24056.500000 3
  163.190575 451522.000000 49
  163.949997 3701.000000 1
  164.349998 3701.000000 1
  165.077781 49963.500000 5
  166.199997 1850.500000 1
  166.800003 3701.000000 1
  167.050003 18505.000000 2
  167.399994 3701.000000 1
  167.800003 1850.500000 1
  168.000000 1850.500000 1
  168.699997 7402.000000 1
  168.899994 7402.000000 1
  169.100006 7402.000000 1
  169.300003 5551.500000 1
  169.750000 7402.000000 1
  170.000000 5551.500000 1
  171.105690 455223.000000 49
  171.800003 12953.500000 1
  172.300003 38860.500000 4
  173.163685 2068859.000000 223
  173.899994 14804.000000 2
  174.224998 14804.000000 2
  175.163637 244266.000000 26
  175.849998 3701.000000 1
  176.199997 7402.000000 1
  177.196397 205405.500000 22
  178.349998 3701.000000 1
  178.650002 3701.000000 1
  179.183334 22206.000000 2
  179.699997 1850.500000 1
  179.899994 1850.500000 1
  180.349998 3701.000000 1
  180.800003 1850.500000 1
  181.050003 11103.000000 1
  181.300003 11103.000000 1
  181.750000 3701.000000 1
  182.125004 7402.000000 1
  182.399994 5551.500000 1
  182.775002 7402.000000 1
  183.399994 12953.500000 1
  183.750000 7402.000000 1
  185.188112 1245386.500000 134
  187.196079 377502.000000 41
  188.000000 12953.500000 1
  189.203054 242415.500000 26
  190.174999 7402.000000 1
  191.122223 99927.000000 11
  192.300003 1850.500000 1
  193.300003 1850.500000 1
  195.116671 11103.000000 1
  196.349998 3701.000000 1
  196.600006 1850.500000 1
  197.016669 22206.000000 2
  198.022224 16654.500000 2
  199.203883 1524812.000000 165
  201.184283 941904.500000 102
  202.077779 133236.000000 14
  203.184785 170246.000000 18
  203.500000 31458.500000 3
  204.500000 1850.500000 1
  205.100002 14804.000000 2
  206.800003 1850.500000 1
  207.050003 3701.000000 1
  208.100006 1850.500000 1
  208.750000 3701.000000 1
  209.199997 1850.500000 1
  209.500000 1850.500000 1
  210.849998 11103.000000 1
  211.279999 18505.000000 2
  211.600006 1850.500000 1
  212.062504 14804.000000 2
  212.300003 14804.000000 2
  213.243454 664329.500000 72
  215.240490 301631.500000 33
  216.243750 29608.000000 3
  217.169655 268322.500000 29
  217.899994 3701.000000 1
  218.100006 3701.000000 1
  218.600006 1850.500000 1
  219.100006 7402.000000 1
  219.300003 1850.500000 1
  222.299998 5551.500000 1
  224.399994 1850.500000 1
  224.899994 5551.500000 1
  225.333333 22206.000000 2
  226.228571 90674.500000 10
  227.233929 310884.000000 34
  228.199997 29608.000000 3
  229.226531 181349.000000 20
  230.146668 55515.000000 6
  231.088889 33309.000000 4
  231.399994 12953.500000 1
  233.100006 1850.500000 1
  236.849998 3701.000000 1
  237.199997 3701.000000 1
  237.500000 1850.500000 1
  238.100006 1850.500000 1
  238.699997 1850.500000 1
  239.028573 12953.500000 1
  240.279167 88824.000000 10
  241.177782 33309.000000 4
  242.055557 16654.500000 2
  242.500000 3701.000000 1
  243.063639 20355.500000 2
  244.050001 22206.000000 2
  244.399994 16654.500000 2
  244.600006 12953.500000 1
  245.215626 355296.000000 38
  246.500000 1850.500000 1
  251.300003 1850.500000 1
  252.399994 3701.000000 1
  252.980002 18505.000000 2
  253.500000 18505.000000 2
  255.310551 9259902.000000 999
  256.899994 5551.500000 1
  257.100006 5551.500000 1
  257.399994 9252.500000 1
  258.256755 136937.000000 15
  262.500000 1850.500000 1
  270.000000 3701.000000 1
  270.200012 1850.500000 1
  271.025002 7402.000000 1
  271.399994 7402.000000 1
  271.799988 3701.000000 1
  273.302797 2910836.500000 314