ACCESSION: MSBNK-PFOS_research_group-FFF00142
RECORD_TITLE: 5-beta-Androstan-17-beta-ol-3-one; LC-APPI-QQ; MS2; CE:20 V; [M-H2O+H]+
DATE: 2016.01.19 (Created 2011.04.04, modified 2011.06.20)
AUTHORS: Atsushi Yamamoto, PFOS.jp
LICENSE: CC BY-SA
COPYRIGHT: PFOS.jp
COMMENT: Disclaimer: While authors make an effort to ensure that the content of this record is accurate, the authors make no representations or warranties in relation to the accuracy or completeness of the record. This record do not reflect any viewpoints of the affiliation and organization to which the authors belong.

CH$NAME: 5-beta-Androstan-17-beta-ol-3-one
CH$NAME: 5-beta-Dihydrotestosterone
CH$NAME: Etiocholane-17-beta-ol-3-one
CH$COMPOUND_CLASS: Natural Product; Steroid hormone
CH$FORMULA: C19H30O2
CH$EXACT_MASS: 290.22458
CH$SMILES: O=C(C4)CC([H])(C3)C(C)(C4)C(C2)C(C3)C(C1)C(C)(C2)C(O)C1
CH$IUPAC: InChI=1S/C19H30O2/c1-18-9-7-13(20)11-12(18)3-4-14-15-5-6-17(21)19(15,2)10-8-16(14)18/h12,14-17,21H,3-11H2,1-2H3/t12-,14?,15?,16?,17+,18?,19?/m1/s1
CH$LINK: CAS 571-22-2
CH$LINK: INCHIKEY NVKAWKQGWWIWPM-NOLKSFPRSA-N

AC$INSTRUMENT: API2000
AC$INSTRUMENT_TYPE: LC-APPI-QQ
AC$MASS_SPECTROMETRY: MS_TYPE MS2
AC$MASS_SPECTROMETRY: ION_MODE POSITIVE
AC$CHROMATOGRAPHY: RETENTION_TIME 0.820850 min

MS$FOCUSED_ION: BASE_PEAK 273.299988
MS$FOCUSED_ION: PRECURSOR_M/Z 273.100000
MS$FOCUSED_ION: PRECURSOR_TYPE [M-H2O+H]+

PK$SPLASH: splash10-05fr-0390000000-5cc8ab57d666eb54ba32
PK$NUM_PEAK: 249
PK$PEAK: m/z int. rel.int.
  39.000000 1850.500000 1
  42.700001 1850.500000 1
  43.000000 1850.500000 1
  43.200001 1850.500000 1
  53.299999 1850.500000 1
  54.900002 3701.000000 1
  55.200001 3701.000000 1
  55.799999 1850.500000 1
  56.725000 7402.000000 1
  57.275001 14804.000000 1
  66.199997 3701.000000 1
  67.056249 29608.000000 1
  67.300003 24056.500000 1
  67.599998 3701.000000 1
  67.900002 1850.500000 1
  68.450001 3701.000000 1
  69.016666 22206.000000 1
  69.900002 1850.500000 1
  70.400002 1850.500000 1
  70.800003 3701.000000 1
  71.000000 7402.000000 1
  76.900002 1850.500000 1
  77.500000 3701.000000 1
  78.000000 5551.500000 1
  78.350002 3701.000000 1
  79.133332 33309.000000 1
  79.800003 3701.000000 1
  80.300003 5551.500000 1
  81.122857 259070.000000 10
  82.099998 1850.500000 1
  82.460001 9252.500000 1
  82.900002 27757.500000 1
  83.900002 1850.500000 1
  84.099998 1850.500000 1
  84.400002 1850.500000 1
  85.099998 18505.000000 1
  89.900002 1850.500000 1
  90.945000 37010.000000 1
  91.699997 1850.500000 1
  92.000000 5551.500000 1
  93.085228 325688.000000 13
  95.072222 532944.000000 22
  96.200001 7402.000000 1
  97.139473 140638.000000 6
  98.099998 1850.500000 1
  98.350002 3701.000000 1
  98.699997 1850.500000 1
  98.900002 9252.500000 1
  99.199997 12953.500000 1
  99.500000 1850.500000 1
  103.400002 3701.000000 1
  103.599998 1850.500000 1
  103.800003 1850.500000 1
  104.199997 7402.000000 1
  105.057746 262771.000000 11
  106.000000 5551.500000 1
  106.199997 7402.000000 1
  107.061745 551449.000000 22
  107.800003 9252.500000 1
  108.300003 16654.500000 1
  109.107500 518140.000000 21
  109.900002 9252.500000 1
  110.199997 9252.500000 1
  111.025000 59216.000000 2
  111.699997 1850.500000 1
  112.750000 3701.000000 1
  113.000000 5551.500000 1
  115.699997 1850.500000 1
  115.900002 1850.500000 1
  116.300003 1850.500000 1
  116.988889 33309.000000 1
  118.099998 7402.000000 1
  119.077869 225761.000000 9
  121.159777 832725.000000 34
  123.056871 484831.000000 20
  124.599998 11103.000000 1
  124.960001 9252.500000 1
  125.300003 5551.500000 1
  125.500000 5551.500000 1
  127.199997 1850.500000 1
  127.400002 1850.500000 1
  127.699997 1850.500000 1
  129.100006 9252.500000 1
  129.600006 1850.500000 1
  130.300003 5551.500000 1
  131.101871 198003.500000 8
  131.699997 9252.500000 1
  132.125004 14804.000000 1
  133.125232 601412.500000 24
  134.073335 27757.500000 1
  135.130284 788313.000000 32
  136.000000 1850.500000 1
  136.600006 20355.500000 1
  137.216494 179498.500000 7
  138.889995 18505.000000 1
  139.233332 22206.000000 1
  139.800003 1850.500000 1
  140.899994 1850.500000 1
  141.199997 3701.000000 1
  141.800003 3701.000000 1
  142.300003 3701.000000 1
  142.600006 5551.500000 1
  142.979999 18505.000000 1
  143.249996 14804.000000 1
  145.097942 1078841.500000 44
  147.165958 1565523.000000 63
  147.800003 14804.000000 1
  148.199997 11103.000000 1
  149.103659 303482.000000 12
  149.800003 3701.000000 1
  150.100006 3701.000000 1
  151.096364 101777.500000 4
  152.199997 3701.000000 1
  153.100001 20355.500000 1
  156.000000 1850.500000 1
  156.800003 12953.500000 1
  157.300003 25907.000000 1
  159.147826 1872706.000000 76
  159.899994 12953.500000 1
  161.130731 1517410.000000 61
  163.184079 371950.500000 15
  163.800003 3701.000000 1
  164.199997 1850.500000 1
  164.500000 3701.000000 1
  165.144448 33309.000000 1
  166.100006 1850.500000 1
  166.399994 1850.500000 1
  167.000000 1850.500000 1
  167.399994 1850.500000 1
  168.650002 3701.000000 1
  169.050003 3701.000000 1
  169.349998 3701.000000 1
  169.899994 3701.000000 1
  170.199997 1850.500000 1
  171.100001 74020.000000 3
  171.600006 9252.500000 1
  171.949997 11103.000000 1
  173.203334 888240.000000 36
  174.050003 3701.000000 1
  174.374996 7402.000000 1
  175.173913 255369.000000 10
  177.250980 188751.000000 8
  178.300003 1850.500000 1
  178.600006 3701.000000 1
  178.966665 11103.000000 1
  179.363635 20355.500000 1
  179.699997 1850.500000 1
  180.100006 1850.500000 1
  180.699997 3701.000000 1
  180.899994 1850.500000 1
  181.349998 7402.000000 1
  182.200002 5551.500000 1
  182.699997 1850.500000 1
  182.899994 3701.000000 1
  183.199997 1850.500000 1
  184.287502 14804.000000 1
  185.143557 603263.000000 24
  187.289130 170246.000000 7
  187.699997 9252.500000 1
  188.100006 1850.500000 1
  188.300003 7402.000000 1
  189.192453 196153.000000 8
  190.100006 1850.500000 1
  190.457142 12953.500000 1
  191.200001 133236.000000 5
  192.000000 1850.500000 1
  193.300003 5551.500000 1
  193.500000 1850.500000 1
  194.800003 1850.500000 1
  195.199997 3701.000000 1
  195.399994 3701.000000 1
  195.899994 1850.500000 1
  196.949997 7402.000000 1
  197.199997 1850.500000 1
  197.500000 7402.000000 1
  198.199997 7402.000000 1
  198.399994 11103.000000 1
  199.194478 938203.500000 38
  200.366662 16654.500000 1
  201.202961 1125104.000000 45
  203.259648 210957.000000 9
  203.899994 1850.500000 1
  204.699997 1850.500000 1
  205.199997 3701.000000 1
  205.600006 3701.000000 1
  207.199997 1850.500000 1
  209.250000 3701.000000 1
  210.199997 3701.000000 1
  210.800003 1850.500000 1
  211.025002 7402.000000 1
  211.699997 1850.500000 1
  212.100006 3701.000000 1
  212.466665 11103.000000 1
  213.232508 523691.500000 21
  213.924995 7402.000000 1
  215.183078 240565.000000 10
  216.199997 5551.500000 1
  216.399994 7402.000000 1
  217.213047 85123.000000 3
  221.600006 3701.000000 1
  225.300003 1850.500000 1
  226.242857 51814.000000 2
  227.274789 220209.500000 9
  227.899994 1850.500000 1
  228.199997 1850.500000 1
  228.399994 1850.500000 1
  229.285715 129535.000000 5
  230.300003 7402.000000 1
  230.500000 3701.000000 1
  230.699997 1850.500000 1
  231.058337 22206.000000 1
  237.299998 11103.000000 1
  238.899994 1850.500000 1
  239.937496 14804.000000 1
  240.650002 14804.000000 1
  241.250001 66618.000000 3
  241.699997 9252.500000 1
  242.250000 11103.000000 1
  242.500000 3701.000000 1
  242.800003 1850.500000 1
  243.250000 11103.000000 1
  243.550003 7402.000000 1
  244.100006 7402.000000 1
  244.500000 11103.000000 1
  245.110345 214658.000000 9
  248.550003 3701.000000 1
  250.800003 1850.500000 1
  251.300003 1850.500000 1
  251.500000 1850.500000 1
  252.000000 1850.500000 1
  252.500000 1850.500000 1
  253.118748 29608.000000 1
  253.814285 25907.000000 1
  255.318253 17093068.500000 690
  256.600006 1850.500000 1
  256.849991 3701.000000 1
  257.299988 1850.500000 1
  258.000000 31458.500000 1
  258.317136 64767.500000 3
  259.500000 1850.500000 1
  270.200012 1850.500000 1
  270.799988 5551.500000 1
  271.399994 11103.000000 1
  273.327981 24733783.000000 999
  274.399994 9252.500000 1
  274.949997 3701.000000 1
  275.399994 1850.500000 1
  346.000000 1850.500000 1
  365.200012 1850.500000 1