ACCESSION: MSBNK-PFOS_research_group-FFF00147
RECORD_TITLE: 5-beta-Androstane-3-alpha,17-beta-diol; LC-APPI-QQ; MS2; CE:40 V; [M-2H2O+H]+
DATE: 2016.01.19 (Created 2011.04.04, modified 2011.06.20)
AUTHORS: Atsushi Yamamoto, PFOS.jp
LICENSE: CC BY-SA
COPYRIGHT: PFOS.jp
COMMENT: Disclaimer: While authors make an effort to ensure that the content of this record is accurate, the authors make no representations or warranties in relation to the accuracy or completeness of the record. This record do not reflect any viewpoints of the affiliation and organization to which the authors belong.

CH$NAME: 5-beta-Androstane-3-alpha,17-beta-diol
CH$NAME: Etiocholane-3-alpha,17-beta-diol
CH$COMPOUND_CLASS: Natural Product; Steroid hormone
CH$FORMULA: C19H32O2
CH$EXACT_MASS: 292.24023
CH$SMILES: OC(C4)CC([H])(C3)C(C)(C4)C(C2)C(C3)C(C1)C(C)(C2)C(O)C1
CH$IUPAC: InChI=1S/C19H32O2/c1-18-9-7-13(20)11-12(18)3-4-14-15-5-6-17(21)19(15,2)10-8-16(14)18/h12-17,20-21H,3-11H2,1-2H3/t12-,13-,14?,15?,16?,17+,18?,19?/m1/s1
CH$LINK: CAS 1851-23-6
CH$LINK: INCHIKEY CBMYJHIOYJEBSB-GCFMDFLISA-N

AC$INSTRUMENT: API2000
AC$INSTRUMENT_TYPE: LC-APPI-QQ
AC$MASS_SPECTROMETRY: MS_TYPE MS2
AC$MASS_SPECTROMETRY: ION_MODE POSITIVE
AC$CHROMATOGRAPHY: RETENTION_TIME 0.820867 min

MS$FOCUSED_ION: BASE_PEAK 95.099998
MS$FOCUSED_ION: PRECURSOR_M/Z 257.300000
MS$FOCUSED_ION: PRECURSOR_TYPE [M-2H2O+H]+

PK$SPLASH: splash10-0apm-9800000000-b68858bb4c7a1977c059
PK$NUM_PEAK: 219
PK$PEAK: m/z int. rel.int.
  38.750000 5402.000000 1
  39.599998 1350.500000 1
  39.900002 1350.500000 1
  40.995455 59422.000000 5
  42.133333 8103.000000 1
  43.321052 51319.000000 5
  43.799999 1350.500000 1
  50.400002 2701.000000 1
  50.650000 2701.000000 1
  51.050000 5402.000000 1
  51.400002 1350.500000 1
  51.700001 1350.500000 1
  52.000000 1350.500000 1
  53.400002 14855.500000 1
  55.092027 1964977.500000 180
  55.916668 8103.000000 1
  56.225000 5402.000000 1
  56.500000 6752.500000 1
  57.205715 94535.000000 9
  58.099998 1350.500000 1
  61.700001 1350.500000 1
  62.000000 1350.500000 1
  63.400002 1350.500000 1
  63.900002 2701.000000 1
  64.099998 4051.500000 1
  64.649998 21608.000000 2
  67.107552 6616099.500000 608
  69.108558 1704331.000000 157
  70.300003 4051.500000 1
  70.500000 2701.000000 1
  71.127272 29711.000000 3
  71.599998 2701.000000 1
  72.699997 1350.500000 1
  73.099998 1350.500000 1
  74.599998 1350.500000 1
  74.900002 1350.500000 1
  75.599998 1350.500000 1
  75.900002 5402.000000 1
  77.068827 437562.000000 40
  79.061940 5429010.000000 499
  81.106952 10878277.500000 999
  83.128265 3019718.000000 277
  84.316669 8103.000000 1
  84.900002 4051.500000 1
  85.099998 4051.500000 1
  85.400002 2701.000000 1
  86.599998 1350.500000 1
  86.900002 2701.000000 1
  87.300003 1350.500000 1
  87.599998 1350.500000 1
  88.199997 2701.000000 1
  91.055001 4819934.500000 443
  93.090870 9467005.000000 869
  95.069448 9936979.000000 913
  97.098245 153957.000000 14
  99.900002 1350.500000 1
  100.699997 2701.000000 1
  101.149998 2701.000000 1
  101.400002 1350.500000 1
  101.900002 4051.500000 1
  105.052589 7930136.000000 728
  107.065178 5080581.000000 467
  109.121671 5172415.000000 475
  110.724998 5402.000000 1
  111.250000 10804.000000 1
  112.500000 1350.500000 1
  112.800003 2701.000000 1
  113.549999 2701.000000 1
  114.199997 1350.500000 1
  115.025000 32412.000000 3
  117.071860 580715.000000 53
  119.064729 4878006.000000 448
  121.111945 2464662.500000 226
  123.095445 652291.500000 60
  124.300003 1350.500000 1
  124.900002 2701.000000 1
  125.199997 2701.000000 1
  126.250000 2701.000000 1
  126.699997 2701.000000 1
  126.900002 1350.500000 1
  127.200001 10804.000000 1
  127.599998 4051.500000 1
  127.933334 8103.000000 1
  128.315380 17556.500000 2
  129.132652 132349.000000 12
  131.156715 1126317.000000 103
  133.146834 2644279.000000 243
  134.199999 63473.500000 6
  135.140364 2375529.500000 218
  137.088235 45917.000000 4
  137.399994 13505.000000 1
  140.300003 1350.500000 1
  140.500000 1350.500000 1
  140.871427 9453.500000 1
  141.399994 4051.500000 1
  142.100006 12154.500000 1
  143.088333 81030.000000 7
  143.746155 35113.000000 3
  145.119520 1688125.000000 155
  147.155270 4100118.000000 377
  149.150837 1453138.000000 133
  150.199997 1350.500000 1
  150.500000 2701.000000 1
  150.899994 4051.500000 1
  151.174999 5402.000000 1
  151.399994 1350.500000 1
  152.699997 2701.000000 1
  152.899994 1350.500000 1
  153.300003 2701.000000 1
  154.199997 5402.000000 1
  155.000000 16206.000000 1
  155.899994 2701.000000 1
  157.238711 83731.000000 8
  159.132551 804898.000000 74
  161.140187 3468084.000000 318
  162.500000 9453.500000 1
  163.188551 401098.500000 37
  164.300003 1350.500000 1
  164.600006 1350.500000 1
  165.399994 1350.500000 1
  166.750000 2701.000000 1
  167.399994 4051.500000 1
  168.000000 1350.500000 1
  168.399994 2701.000000 1
  169.062500 21608.000000 2
  169.600006 5402.000000 1
  169.800003 1350.500000 1
  170.800003 16206.000000 1
  171.130437 62123.000000 6
  172.184998 27010.000000 2
  173.204484 602323.000000 55
  174.277274 29711.000000 3
  175.164605 1331593.000000 122
  176.300003 2701.000000 1
  177.112505 10804.000000 1
  177.500000 9453.500000 1
  178.300003 5402.000000 1
  178.500000 1350.500000 1
  179.050003 2701.000000 1
  179.300003 2701.000000 1
  179.800003 1350.500000 1
  181.000000 2701.000000 1
  181.349998 5402.000000 1
  181.600006 1350.500000 1
  182.000000 4051.500000 1
  183.199997 12154.500000 1
  184.199997 5402.000000 1
  184.540002 6752.500000 1
  185.219673 82380.500000 8
  186.199997 21608.000000 2
  187.172170 572612.000000 53
  189.231159 372738.000000 34
  190.250000 2701.000000 1
  190.800003 1350.500000 1
  191.100006 2701.000000 1
  191.399994 1350.500000 1
  194.100006 1350.500000 1
  194.399994 1350.500000 1
  195.000000 5402.000000 1
  195.300003 1350.500000 1
  195.500000 1350.500000 1
  196.250000 2701.000000 1
  196.600006 5402.000000 1
  196.899994 8103.000000 1
  197.177778 12154.500000 1
  198.000000 5402.000000 1
  199.264704 91834.000000 8
  201.179805 976411.500000 90
  203.300003 2701.000000 1
  203.600006 1350.500000 1
  203.800003 1350.500000 1
  205.500000 1350.500000 1
  208.300003 1350.500000 1
  209.199997 2701.000000 1
  209.500000 1350.500000 1
  209.899994 1350.500000 1
  210.449997 2701.000000 1
  211.199997 4051.500000 1
  211.449997 2701.000000 1
  211.750000 2701.000000 1
  212.000000 2701.000000 1
  212.199997 1350.500000 1
  213.199997 17556.500000 2
  214.164709 45917.000000 4
  215.185265 128297.500000 12
  216.150002 5402.000000 1
  217.000000 1350.500000 1
  218.000000 1350.500000 1
  221.100006 1350.500000 1
  221.399994 1350.500000 1
  223.000000 1350.500000 1
  223.699997 1350.500000 1
  224.199997 2701.000000 1
  224.699997 2701.000000 1
  225.016668 8103.000000 1
  225.300003 6752.500000 1
  225.550003 2701.000000 1
  226.399994 10804.000000 1
  227.114002 67525.000000 6
  228.233333 162060.000000 15
  229.144086 125596.500000 12
  229.800003 1350.500000 1
  231.000000 4051.500000 1
  237.000000 1350.500000 1
  237.300003 1350.500000 1
  237.500000 4051.500000 1
  238.399994 1350.500000 1
  238.879996 13505.000000 1
  239.250002 40515.000000 4
  239.849998 5402.000000 1
  240.500000 2701.000000 1
  240.699997 1350.500000 1
  241.000000 2701.000000 1
  241.377779 12154.500000 1
  242.362162 49968.500000 5
  254.849998 8103.000000 1
  255.200005 16206.000000 1
  256.012501 10804.000000 1
  257.337382 722517.500000 66