ACCESSION: MSBNK-PFOS_research_group-FFF00181
RECORD_TITLE: Epiandrosterone; LC-APPI-QQ; MS2; CE:50 V; [M-H2O+H]+
DATE: 2016.01.19 (Created 2011.04.05, modified 2011.06.20)
AUTHORS: Atsushi Yamamoto, PFOS.jp
LICENSE: CC BY-SA
COPYRIGHT: PFOS.jp
COMMENT: Disclaimer: While authors make an effort to ensure that the content of this record is accurate, the authors make no representations or warranties in relation to the accuracy or completeness of the record. This record do not reflect any viewpoints of the affiliation and organization to which the authors belong.

CH$NAME: Epiandrosterone
CH$NAME: 3-beta-Hydroxy-5alpha-androstan-17-one
CH$COMPOUND_CLASS: Natural Product; Steroid hormone
CH$FORMULA: C19H30O2
CH$EXACT_MASS: 290.22458
CH$SMILES: OC(C4)CC([H])(C3)C(C)(C4)C(C2)C(C3)C(C1)C(C)(C2)C(=O)C1
CH$IUPAC: InChI=1S/C19H30O2/c1-18-9-7-13(20)11-12(18)3-4-14-15-5-6-17(21)19(15,2)10-8-16(14)18/h12-16,20H,3-11H2,1-2H3/t12-,13-,14?,15?,16?,18?,19?/m0/s1
CH$LINK: CAS 481-29-8
CH$LINK: LIPIDBANK SST0205
CH$LINK: INCHIKEY QGXBDMJGAMFCBF-CYFBJHQBSA-N

AC$INSTRUMENT: API2000
AC$INSTRUMENT_TYPE: LC-APPI-QQ
AC$MASS_SPECTROMETRY: MS_TYPE MS2
AC$MASS_SPECTROMETRY: ION_MODE POSITIVE
AC$CHROMATOGRAPHY: RETENTION_TIME 0.820833 min

MS$FOCUSED_ION: BASE_PEAK 105.000000
MS$FOCUSED_ION: PRECURSOR_M/Z 273.300000
MS$FOCUSED_ION: PRECURSOR_TYPE [M-H2O+H]+

PK$SPLASH: splash10-05ox-9800000000-99ab629191e6f7c34832
PK$NUM_PEAK: 275
PK$PEAK: m/z int. rel.int.
  37.599998 1350.500000 1
  38.799999 1350.500000 1
  39.200001 1350.500000 1
  39.500000 1350.500000 1
  39.900002 2701.000000 1
  41.070213 63473.500000 15
  41.599998 4051.500000 1
  41.900000 4051.500000 1
  42.200001 6752.500000 2
  43.087951 112091.500000 26
  44.799999 1350.500000 1
  50.549999 2701.000000 1
  50.799999 5402.000000 1
  51.400002 2701.000000 1
  52.299999 1350.500000 1
  53.130000 54020.000000 12
  55.066497 794094.000000 181
  56.299999 2701.000000 1
  57.107143 37814.000000 9
  57.400002 9453.500000 2
  57.799999 1350.500000 1
  58.299999 1350.500000 1
  58.900002 2701.000000 1
  59.099998 1350.500000 1
  59.500000 1350.500000 1
  62.250000 2701.000000 1
  62.750000 2701.000000 1
  63.650000 2701.000000 1
  64.500000 5402.000000 1
  65.066667 81030.000000 19
  65.800003 14855.500000 3
  67.135253 1547673.000000 354
  69.066372 305213.000000 70
  70.099998 5402.000000 1
  71.052380 28360.500000 6
  72.599998 1350.500000 1
  72.800003 2701.000000 1
  73.099998 1350.500000 1
  73.500000 1350.500000 1
  75.099998 2701.000000 1
  75.350002 2701.000000 1
  75.699997 12154.500000 3
  77.057016 1212749.000000 277
  79.057810 3527506.000000 806
  81.108681 2488971.500000 569
  82.000000 5402.000000 1
  83.096179 212028.500000 48
  83.900002 1350.500000 1
  84.099998 1350.500000 1
  84.900002 10804.000000 2
  85.099998 6752.500000 2
  85.300003 10804.000000 2
  86.400002 1350.500000 1
  87.199997 1350.500000 1
  87.699997 2701.000000 1
  88.500000 8103.000000 2
  89.000000 8103.000000 2
  91.071835 4372919.000000 999
  93.103861 2798236.000000 639
  95.070024 1153327.000000 263
  95.900002 2701.000000 1
  96.731249 21608.000000 5
  97.192728 74277.500000 17
  98.300003 1350.500000 1
  98.599998 2701.000000 1
  98.800003 1350.500000 1
  99.099998 2701.000000 1
  99.350002 2701.000000 1
  99.900002 1350.500000 1
  100.500000 1350.500000 1
  101.350002 2701.000000 1
  101.599998 2701.000000 1
  101.800003 2701.000000 1
  103.096078 137751.000000 31
  105.064279 4090664.500000 935
  107.060782 1277573.000000 292
  108.300001 22958.500000 5
  109.039999 141802.500000 32
  110.840001 6752.500000 2
  111.099998 13505.000000 3
  111.500000 1350.500000 1
  111.750000 2701.000000 1
  113.350000 5402.000000 1
  115.047297 199874.000000 46
  117.097419 627982.500000 143
  119.088249 2252634.000000 515
  120.000000 8103.000000 2
  120.264287 18907.000000 4
  121.122885 271450.500000 62
  122.000000 6752.500000 2
  122.199997 1350.500000 1
  122.500000 5402.000000 1
  123.072000 67525.000000 15
  125.000000 12154.500000 3
  125.400002 2701.000000 1
  125.699997 1350.500000 1
  125.900002 1350.500000 1
  126.199997 4051.500000 1
  127.147058 68875.500000 16
  128.133333 372738.000000 85
  129.087428 698208.500000 160
  131.151591 1018277.000000 233
  133.180597 542901.000000 124
  133.800003 4051.500000 1
  134.184620 17556.500000 4
  134.600006 22958.500000 5
  135.105387 175565.000000 40
  136.733332 8103.000000 2
  137.000000 2701.000000 1
  137.199997 5402.000000 1
  138.000000 1350.500000 1
  138.500000 1350.500000 1
  138.800003 2701.000000 1
  139.399994 4051.500000 1
  141.202666 101287.500000 23
  143.097993 740074.000000 169
  145.160312 779238.500000 178
  147.179053 599622.000000 137
  149.000000 27010.000000 6
  150.899994 1350.500000 1
  151.199997 6752.500000 2
  152.133336 8103.000000 2
  152.699997 5402.000000 1
  153.337500 10804.000000 2
  153.800003 6752.500000 2
  154.199997 8103.000000 2
  155.127588 78329.000000 18
  156.300001 70226.000000 16
  157.129704 545602.000000 125
  158.128127 86432.000000 20
  159.124346 515891.000000 118
  161.151811 372738.000000 85
  162.100006 5402.000000 1
  163.099997 13505.000000 3
  163.416662 8103.000000 2
  163.899994 2701.000000 1
  164.399994 1350.500000 1
  164.600006 2701.000000 1
  165.099998 10804.000000 2
  165.800003 2701.000000 1
  166.349998 2701.000000 1
  166.949997 16206.000000 4
  167.399994 4051.500000 1
  167.600006 4051.500000 1
  168.125002 21608.000000 5
  169.098319 160709.500000 37
  171.225881 229585.000000 52
  172.100006 16206.000000 4
  173.198369 248492.000000 57
  174.299998 4051.500000 1
  175.033334 12154.500000 3
  175.525002 5402.000000 1
  176.000000 4051.500000 1
  176.300003 1350.500000 1
  176.800003 1350.500000 1
  177.000000 4051.500000 1
  177.199997 2701.000000 1
  177.500000 2701.000000 1
  177.699997 1350.500000 1
  178.349998 8103.000000 2
  178.800003 1350.500000 1
  179.399994 2701.000000 1
  180.300003 1350.500000 1
  180.600006 1350.500000 1
  180.800003 4051.500000 1
  181.200001 10804.000000 2
  181.600006 4051.500000 1
  181.849998 2701.000000 1
  182.100006 4051.500000 1
  182.325001 5402.000000 1
  183.130559 48618.000000 11
  183.424995 27010.000000 6
  184.308695 62123.000000 14
  185.147622 170163.000000 39
  185.974998 10804.000000 2
  186.233332 16206.000000 4
  187.123685 51319.000000 12
  187.800003 5402.000000 1
  188.000000 2701.000000 1
  188.199997 6752.500000 2
  189.228571 47267.500000 11
  189.950001 5402.000000 1
  190.600006 1350.500000 1
  190.949997 5402.000000 1
  191.300003 2701.000000 1
  192.000000 1350.500000 1
  193.399994 1350.500000 1
  194.699997 2701.000000 1
  194.899994 1350.500000 1
  195.199997 5402.000000 1
  195.600006 1350.500000 1
  195.800003 2701.000000 1
  196.300003 2701.000000 1
  197.217391 31061.500000 7
  198.052173 31061.500000 7
  199.197590 224183.000000 51
  200.187502 21608.000000 5
  201.075005 21608.000000 5
  201.537502 10804.000000 2
  202.116667 145854.000000 33
  202.800003 4051.500000 1
  203.449997 2701.000000 1
  203.800003 2701.000000 1
  204.899994 1350.500000 1
  205.349998 2701.000000 1
  206.899994 1350.500000 1
  208.500000 1350.500000 1
  210.000000 2701.000000 1
  210.399994 1350.500000 1
  211.214287 37814.000000 9
  211.600006 5402.000000 1
  211.899994 1350.500000 1
  212.220001 13505.000000 3
  213.100006 27010.000000 6
  214.100006 8103.000000 2
  214.424995 5402.000000 1
  215.050001 43216.000000 10
  216.100000 13505.000000 3
  216.600006 1350.500000 1
  217.000000 4051.500000 1
  217.300003 8103.000000 2
  218.100006 1350.500000 1
  218.800003 1350.500000 1
  225.184003 33762.500000 8
  226.250001 43216.000000 10
  226.699997 4051.500000 1
  226.899994 4051.500000 1
  227.250000 16206.000000 4
  228.055557 12154.500000 3
  228.674999 5402.000000 1
  229.075005 10804.000000 2
  229.300003 9453.500000 2
  229.899994 5402.000000 1
  230.600006 1350.500000 1
  231.000000 2701.000000 1
  231.300003 1350.500000 1
  232.199997 2701.000000 1
  232.399994 1350.500000 1
  232.899994 1350.500000 1
  237.199997 1350.500000 1
  238.300003 2701.000000 1
  239.033333 8103.000000 2
  239.899994 4051.500000 1
  240.199997 6752.500000 2
  240.500000 2701.000000 1
  240.699997 2701.000000 1
  241.300003 1350.500000 1
  241.650002 2701.000000 1
  242.150002 2701.000000 1
  242.399994 1350.500000 1
  242.600006 1350.500000 1
  243.000000 2701.000000 1
  243.300003 4051.500000 1
  243.899994 2701.000000 1
  244.100006 1350.500000 1
  244.599998 5402.000000 1
  244.899994 4051.500000 1
  245.399994 8103.000000 2
  253.100000 6752.500000 2
  253.500000 1350.500000 1
  254.100006 1350.500000 1
  255.331250 21608.000000 5
  255.600006 6752.500000 2
  256.000000 1350.500000 1
  257.050003 2701.000000 1
  257.349991 5402.000000 1
  257.600006 1350.500000 1
  258.100006 6752.500000 2
  258.600006 1350.500000 1
  271.000000 1350.500000 1
  271.200012 2701.000000 1
  271.500000 1350.500000 1
  272.100006 2701.000000 1
  272.600006 2701.000000 1
  273.349998 10804.000000 2