ACCESSION: MSBNK-PFOS_research_group-FFF00183
RECORD_TITLE: Epiandrosterone; LC-APPI-QQ; MS2; CE:30 V; [M-H2O+H]+
DATE: 2016.01.19 (Created 2011.04.05, modified 2011.06.20)
AUTHORS: Atsushi Yamamoto, PFOS.jp
LICENSE: CC BY-SA
COPYRIGHT: PFOS.jp
COMMENT: Disclaimer: While authors make an effort to ensure that the content of this record is accurate, the authors make no representations or warranties in relation to the accuracy or completeness of the record. This record do not reflect any viewpoints of the affiliation and organization to which the authors belong.

CH$NAME: Epiandrosterone
CH$NAME: 3-beta-Hydroxy-5alpha-androstan-17-one
CH$COMPOUND_CLASS: Natural Product; Steroid hormone
CH$FORMULA: C19H30O2
CH$EXACT_MASS: 290.22458
CH$SMILES: OC(C4)CC([H])(C3)C(C)(C4)C(C2)C(C3)C(C1)C(C)(C2)C(=O)C1
CH$IUPAC: InChI=1S/C19H30O2/c1-18-9-7-13(20)11-12(18)3-4-14-15-5-6-17(21)19(15,2)10-8-16(14)18/h12-16,20H,3-11H2,1-2H3/t12-,13-,14?,15?,16?,18?,19?/m0/s1
CH$LINK: CAS 481-29-8
CH$LINK: LIPIDBANK SST0205
CH$LINK: INCHIKEY QGXBDMJGAMFCBF-CYFBJHQBSA-N

AC$INSTRUMENT: API2000
AC$INSTRUMENT_TYPE: LC-APPI-QQ
AC$MASS_SPECTROMETRY: MS_TYPE MS2
AC$MASS_SPECTROMETRY: ION_MODE POSITIVE
AC$CHROMATOGRAPHY: RETENTION_TIME 0.820850 min

MS$FOCUSED_ION: BASE_PEAK 147.300003
MS$FOCUSED_ION: PRECURSOR_M/Z 273.300000
MS$FOCUSED_ION: PRECURSOR_TYPE [M-H2O+H]+

PK$SPLASH: splash10-0a4j-1920000000-539c4b605717c01d4456
PK$NUM_PEAK: 247
PK$PEAK: m/z int. rel.int.
  38.700001 1350.500000 1
  40.250000 2701.000000 1
  41.299999 2701.000000 1
  42.500000 2701.000000 1
  42.850000 10804.000000 2
  43.275000 5402.000000 1
  50.900002 1350.500000 1
  52.900002 1350.500000 1
  53.099998 2701.000000 1
  54.200001 4051.500000 1
  54.599998 2701.000000 1
  55.121428 37814.000000 8
  55.750000 2701.000000 1
  57.200001 12154.500000 3
  57.400002 2701.000000 1
  59.150000 2701.000000 1
  64.800003 2701.000000 1
  65.099998 4051.500000 1
  65.599998 2701.000000 1
  66.300003 4051.500000 1
  67.096581 158008.500000 34
  68.199997 1350.500000 1
  68.935295 45917.000000 10
  69.246154 35113.000000 8
  70.000000 1350.500000 1
  71.033333 16206.000000 3
  71.500000 2701.000000 1
  72.900002 1350.500000 1
  75.500000 1350.500000 1
  75.950001 2701.000000 1
  76.199997 1350.500000 1
  77.088234 45917.000000 10
  77.800003 4051.500000 1
  78.000000 5402.000000 1
  79.073034 480778.000000 103
  81.112102 848114.000000 182
  82.545833 32412.000000 7
  83.127848 213379.000000 46
  84.000000 2701.000000 1
  84.757143 18907.000000 4
  85.179997 20257.500000 4
  87.099998 1350.500000 1
  88.000000 1350.500000 1
  88.800003 1350.500000 1
  89.199997 2701.000000 1
  89.500000 1350.500000 1
  89.699997 1350.500000 1
  89.900002 1350.500000 1
  91.028014 380841.000000 82
  91.986667 20257.500000 4
  93.122131 988566.000000 213
  93.988889 24309.000000 5
  95.069697 713064.000000 153
  97.097959 132349.000000 28
  98.400002 2701.000000 1
  98.799999 5402.000000 1
  99.099998 4051.500000 1
  99.325003 5402.000000 1
  99.599998 1350.500000 1
  100.500000 1350.500000 1
  100.699997 1350.500000 1
  101.250000 2701.000000 1
  102.500000 1350.500000 1
  103.066666 8103.000000 2
  105.032065 1170883.500000 252
  107.068270 2357973.000000 507
  109.101546 523994.000000 113
  110.500000 1350.500000 1
  110.900002 21608.000000 5
  111.134613 35113.000000 8
  112.800003 5402.000000 1
  113.099998 1350.500000 1
  113.400002 4051.500000 1
  113.800003 1350.500000 1
  114.250000 2701.000000 1
  114.800003 5402.000000 1
  115.099998 5402.000000 1
  115.400002 2701.000000 1
  115.900002 5402.000000 1
  116.387502 10804.000000 2
  117.101283 210678.000000 45
  117.800003 4051.500000 1
  119.078049 775187.000000 167
  121.076515 713064.000000 153
  123.046315 256595.000000 55
  124.000000 2701.000000 1
  125.117648 45917.000000 10
  127.000000 1350.500000 1
  127.500000 2701.000000 1
  128.199997 8103.000000 2
  129.110713 37814.000000 8
  130.140000 33762.500000 7
  131.175927 437562.000000 94
  131.699997 12154.500000 3
  133.131490 952102.500000 205
  135.136884 1039885.000000 224
  136.500000 4051.500000 1
  137.204000 67525.000000 15
  137.800003 1350.500000 1
  139.149998 10804.000000 2
  139.600006 1350.500000 1
  140.600006 1350.500000 1
  140.899994 2701.000000 1
  141.374996 5402.000000 1
  142.000000 6752.500000 1
  143.090000 229585.000000 49
  145.095283 1431530.000000 308
  147.151854 2841452.000000 611
  149.157564 321419.000000 69
  150.399994 2701.000000 1
  151.140676 79679.500000 17
  152.100006 1350.500000 1
  152.349998 2701.000000 1
  152.800003 8103.000000 2
  153.100006 6752.500000 1
  153.949997 2701.000000 1
  154.600006 1350.500000 1
  154.800003 2701.000000 1
  155.000000 8103.000000 2
  155.399994 2701.000000 1
  155.800003 2701.000000 1
  156.100002 10804.000000 2
  157.174244 178266.000000 38
  157.699997 10804.000000 2
  159.126809 1904205.000000 410
  161.144403 4367517.000000 940
  163.127478 299811.000000 65
  164.300003 1350.500000 1
  164.600006 5402.000000 1
  165.009091 29711.000000 6
  166.100006 1350.500000 1
  166.300003 1350.500000 1
  166.500000 1350.500000 1
  167.100006 6752.500000 1
  167.399994 4051.500000 1
  168.100006 2701.000000 1
  168.500000 1350.500000 1
  169.099998 10804.000000 2
  169.449997 8103.000000 2
  169.699997 4051.500000 1
  170.000000 5402.000000 1
  171.104839 334924.000000 72
  173.199825 1542271.000000 332
  173.899994 6752.500000 1
  175.158452 383542.000000 83
  176.300003 2701.000000 1
  177.138710 83731.000000 18
  178.500000 4051.500000 1
  178.800003 4051.500000 1
  179.136365 29711.000000 6
  179.949997 2701.000000 1
  180.199997 1350.500000 1
  180.500000 5402.000000 1
  180.987499 10804.000000 2
  181.199997 9453.500000 2
  181.500000 4051.500000 1
  181.775002 5402.000000 1
  182.100006 2701.000000 1
  182.474998 5402.000000 1
  183.180953 28360.500000 6
  183.849998 10804.000000 2
  185.200372 723868.000000 156
  186.055559 24309.000000 5
  187.171590 356532.000000 77
  189.190000 162060.000000 35
  189.800003 2701.000000 1
  190.300003 1350.500000 1
  191.175000 43216.000000 9
  193.399994 4051.500000 1
  194.000000 1350.500000 1
  194.600006 1350.500000 1
  195.000000 12154.500000 3
  195.325001 5402.000000 1
  195.699997 1350.500000 1
  196.075005 5402.000000 1
  197.399994 13505.000000 3
  198.154168 32412.000000 7
  199.211829 1735392.500000 373
  200.222580 83731.000000 18
  201.158000 202575.000000 44
  202.076924 35113.000000 8
  203.247222 97236.000000 21
  204.849998 2701.000000 1
  205.399994 1350.500000 1
  207.199997 1350.500000 1
  207.399994 1350.500000 1
  209.250000 2701.000000 1
  210.500000 1350.500000 1
  211.000000 12154.500000 3
  213.221929 615828.000000 133
  214.282352 22958.500000 5
  215.238033 316017.000000 68
  217.204819 112091.500000 24
  217.899994 1350.500000 1
  218.399994 1350.500000 1
  222.800003 1350.500000 1
  224.449997 2701.000000 1
  225.199997 5402.000000 1
  225.449997 8103.000000 2
  226.000000 29711.000000 6
  227.180173 156658.000000 34
  227.800003 6752.500000 1
  228.075005 5402.000000 1
  228.300003 4051.500000 1
  229.251853 36463.500000 8
  229.500000 21608.000000 5
  229.800003 6752.500000 1
  230.242857 18907.000000 4
  230.699997 4051.500000 1
  230.999998 10804.000000 2
  231.474998 5402.000000 1
  232.199997 1350.500000 1
  236.699997 1350.500000 1
  237.199997 1350.500000 1
  237.500000 2701.000000 1
  238.300003 2701.000000 1
  239.000000 2701.000000 1
  239.374996 5402.000000 1
  240.256863 68875.500000 15
  241.322222 12154.500000 3
  242.300003 2701.000000 1
  242.600006 2701.000000 1
  242.949997 5402.000000 1
  243.399994 2701.000000 1
  243.600006 1350.500000 1
  243.800003 1350.500000 1
  244.199997 6752.500000 1
  244.992857 18907.000000 4
  245.600006 9453.500000 2
  250.300003 1350.500000 1
  251.899994 1350.500000 1
  253.066666 24309.000000 5
  253.500000 6752.500000 1
  255.334090 4643019.000000 999
  256.200012 2701.000000 1
  256.399994 4051.500000 1
  256.750000 2701.000000 1
  257.000000 1350.500000 1
  257.299988 1350.500000 1
  257.700012 1350.500000 1
  258.228572 37814.000000 8
  270.700012 1350.500000 1
  271.200012 2701.000000 1
  272.316655 8103.000000 2
  273.336748 1212749.000000 261
  274.399994 1350.500000 1
  274.899994 1350.500000 1