ACCESSION: MSBNK-PFOS_research_group-FFF00188
RECORD_TITLE: Epiandrosterone; LC-APPI-QQ; MS2; CE:40 V; [M-2H2O+H]+
DATE: 2016.01.19 (Created 2011.04.05, modified 2011.06.20)
AUTHORS: Atsushi Yamamoto, PFOS.jp
LICENSE: CC BY-SA
COPYRIGHT: PFOS.jp
COMMENT: Disclaimer: While authors make an effort to ensure that the content of this record is accurate, the authors make no representations or warranties in relation to the accuracy or completeness of the record. This record do not reflect any viewpoints of the affiliation and organization to which the authors belong.

CH$NAME: Epiandrosterone
CH$NAME: 3-beta-Hydroxy-5alpha-androstan-17-one
CH$COMPOUND_CLASS: Natural Product; Steroid hormone
CH$FORMULA: C19H30O2
CH$EXACT_MASS: 290.22458
CH$SMILES: OC(C4)CC([H])(C3)C(C)(C4)C(C2)C(C3)C(C1)C(C)(C2)C(=O)C1
CH$IUPAC: InChI=1S/C19H30O2/c1-18-9-7-13(20)11-12(18)3-4-14-15-5-6-17(21)19(15,2)10-8-16(14)18/h12-16,20H,3-11H2,1-2H3/t12-,13-,14?,15?,16?,18?,19?/m0/s1
CH$LINK: CAS 481-29-8
CH$LINK: LIPIDBANK SST0205
CH$LINK: INCHIKEY QGXBDMJGAMFCBF-CYFBJHQBSA-N

AC$INSTRUMENT: API2000
AC$INSTRUMENT_TYPE: LC-APPI-QQ
AC$MASS_SPECTROMETRY: MS_TYPE MS2
AC$MASS_SPECTROMETRY: ION_MODE POSITIVE
AC$CHROMATOGRAPHY: RETENTION_TIME 0.820850 min

MS$FOCUSED_ION: BASE_PEAK 81.099998
MS$FOCUSED_ION: PRECURSOR_M/Z 255.300000
MS$FOCUSED_ION: PRECURSOR_TYPE [M-2H2O+H]+

PK$SPLASH: splash10-0537-6900000000-01b19e4b22af0916face
PK$NUM_PEAK: 201
PK$PEAK: m/z int. rel.int.
  38.250000 2701.000000 1
  38.900002 4051.500000 1
  39.099998 2701.000000 1
  39.400002 2701.000000 1
  39.700001 2701.000000 1
  40.299999 4051.500000 1
  41.200000 78329.000000 5
  42.000000 4051.500000 1
  43.093125 216080.000000 13
  49.900002 1350.500000 1
  50.200001 1350.500000 1
  50.574999 5402.000000 1
  51.200001 5402.000000 1
  51.400002 2701.000000 1
  51.650000 2701.000000 1
  52.100000 5402.000000 1
  52.872728 29711.000000 2
  53.226667 40515.000000 2
  53.799999 16206.000000 1
  54.000000 16206.000000 1
  55.086696 2456559.500000 151
  56.387500 21608.000000 1
  57.130000 162060.000000 10
  57.599998 5402.000000 1
  57.900002 2701.000000 1
  58.150000 2701.000000 1
  58.700001 1350.500000 1
  58.900002 4051.500000 1
  59.200001 2701.000000 1
  62.299999 1350.500000 1
  62.599998 1350.500000 1
  62.825000 5402.000000 1
  63.150000 2701.000000 1
  63.599998 1350.500000 1
  63.900002 4051.500000 1
  65.114036 153957.000000 9
  67.116180 7728911.500000 475
  69.102283 1774557.000000 109
  70.300003 2701.000000 1
  71.033333 16206.000000 1
  71.900002 1350.500000 1
  73.000000 1350.500000 1
  74.300003 1350.500000 1
  74.599998 2701.000000 1
  74.900002 4051.500000 1
  75.099998 1350.500000 1
  77.073810 1758351.000000 108
  79.049882 10255697.000000 630
  81.107209 16147928.500000 992
  83.110902 2576754.000000 158
  84.400002 1350.500000 1
  84.599998 1350.500000 1
  84.900002 4051.500000 1
  85.350002 5402.000000 1
  85.599998 1350.500000 1
  86.599998 1350.500000 1
  86.900002 1350.500000 1
  87.300003 4051.500000 1
  88.133331 8103.000000 1
  91.055345 12127490.000000 745
  93.101486 11814174.000000 726
  95.065403 9579096.500000 589
  96.099998 9453.500000 1
  97.199997 36463.500000 2
  98.800003 1350.500000 1
  100.199997 1350.500000 1
  100.400002 2701.000000 1
  100.800003 1350.500000 1
  101.099998 1350.500000 1
  101.500000 4051.500000 1
  105.049784 16260020.000000 999
  107.052910 6613398.500000 406
  109.094219 2756370.500000 169
  110.099998 2701.000000 1
  110.599998 1350.500000 1
  111.400002 5402.000000 1
  112.300003 1350.500000 1
  112.900002 2701.000000 1
  113.724998 5402.000000 1
  115.040594 545602.000000 34
  117.081302 4210859.000000 259
  119.078547 6471596.000000 398
  121.100119 2262087.500000 139
  123.078261 496984.000000 31
  123.800003 1350.500000 1
  124.099998 2701.000000 1
  124.500000 1350.500000 1
  124.950001 2701.000000 1
  125.966667 8103.000000 1
  126.300003 6752.500000 1
  129.086436 3046728.000000 187
  131.140297 7654634.000000 470
  133.151027 3813812.000000 234
  135.138366 1619249.500000 99
  136.299995 5402.000000 1
  137.300003 10804.000000 1
  138.399994 1350.500000 1
  138.983336 16206.000000 1
  139.300003 4051.500000 1
  139.600006 1350.500000 1
  140.075005 10804.000000 1
  143.090682 4551185.000000 280
  145.103184 12131541.500000 745
  147.153124 5145405.000000 316
  149.157273 742775.000000 46
  149.899994 1350.500000 1
  150.199997 1350.500000 1
  150.500000 4051.500000 1
  150.800003 2701.000000 1
  151.000000 9453.500000 1
  151.399994 8103.000000 1
  151.849998 10804.000000 1
  152.300003 6752.500000 1
  153.106666 40515.000000 2
  154.091672 16206.000000 1
  155.100000 421356.000000 26
  157.150594 3635546.000000 223
  159.144957 6909158.000000 424
  161.156015 4243271.000000 261
  162.118754 21608.000000 1
  163.213794 78329.000000 5
  163.500000 20257.500000 1
  164.100006 1350.500000 1
  164.928571 9453.500000 1
  165.399997 6752.500000 1
  165.699997 4051.500000 1
  166.066671 8103.000000 1
  167.116670 32412.000000 2
  169.147519 380841.000000 23
  171.111318 3555866.500000 218
  173.196707 4838841.500000 297
  174.192646 91834.000000 6
  175.205465 494283.000000 30
  176.399994 2701.000000 1
  176.800003 4051.500000 1
  177.252172 31061.500000 2
  179.399994 5402.000000 1
  179.874996 5402.000000 1
  180.899994 9453.500000 1
  181.399994 12154.500000 1
  183.134876 379490.500000 23
  185.171926 3800307.000000 233
  187.174597 1674620.000000 103
  189.210025 538849.500000 33
  190.849998 2701.000000 1
  192.000000 1350.500000 1
  192.500000 1350.500000 1
  192.800003 1350.500000 1
  193.200005 5402.000000 1
  194.000000 5402.000000 1
  194.399994 2701.000000 1
  195.000000 16206.000000 1
  196.091672 16206.000000 1
  196.399994 6752.500000 1
  197.206690 383542.000000 24
  199.210536 4614658.500000 284
  201.169938 646889.500000 40
  201.899994 1350.500000 1
  202.199997 1350.500000 1
  206.650002 2701.000000 1
  206.949997 2701.000000 1
  208.300003 1350.500000 1
  208.600006 1350.500000 1
  209.100006 8103.000000 1
  209.500000 2701.000000 1
  209.800003 1350.500000 1
  211.178883 434861.000000 27
  211.899994 24309.000000 1
  213.242094 1264068.000000 78
  214.272729 59422.000000 4
  214.899994 1350.500000 1
  217.300003 2701.000000 1
  218.399994 1350.500000 1
  218.600006 1350.500000 1
  220.899994 1350.500000 1
  221.100006 1350.500000 1
  221.300003 1350.500000 1
  221.800003 2701.000000 1
  223.255556 24309.000000 1
  223.800003 4051.500000 1
  224.100006 4051.500000 1
  224.366664 8103.000000 1
  225.221428 302512.000000 19
  226.166407 345728.000000 21
  227.262366 502386.000000 31
  228.300003 1350.500000 1
  236.100006 1350.500000 1
  236.600006 1350.500000 1
  237.100006 2701.000000 1
  238.300003 2701.000000 1
  238.500000 1350.500000 1
  239.324999 21608.000000 1
  240.282835 180967.000000 11
  251.000000 1350.500000 1
  251.600006 1350.500000 1
  252.100006 1350.500000 1
  252.600006 1350.500000 1
  253.329032 83731.000000 5
  254.000000 1350.500000 1
  255.326734 3192582.000000 196
  256.200012 1350.500000 1