ACCESSION: MSBNK-PFOS_research_group-FFF00272
RECORD_TITLE: beta-Estradiol; LC-APPI-QQ; MS2; CE:60 V; [M-H2O+H]+
DATE: 2016.01.19 (Created 2011.04.05, modified 2011.06.20)
AUTHORS: Atsushi Yamamoto, PFOS.jp
LICENSE: CC BY-SA
COPYRIGHT: PFOS.jp
COMMENT: Disclaimer: While authors make an effort to ensure that the content of this record is accurate, the authors make no representations or warranties in relation to the accuracy or completeness of the record. This record do not reflect any viewpoints of the affiliation and organization to which the authors belong.

CH$NAME: beta-Estradiol
CH$COMPOUND_CLASS: Natural Product; Steroid hormone
CH$FORMULA: C18H24O2
CH$EXACT_MASS: 272.17763
CH$SMILES: Oc(c4)cc(C3)c(c4)C(C2)C(C3)C(C1)C(C)(C2)C(O)C1
CH$IUPAC: InChI=1S/C18H24O2/c1-18-9-8-14-13-5-3-12(19)10-11(13)2-4-15(14)16(18)6-7-17(18)20/h3,5,10,14-17,19-20H,2,4,6-9H2,1H3/t14?,15?,16?,17-,18?/m0/s1
CH$LINK: CAS 50-28-2
CH$LINK: LIPIDBANK SST0013
CH$LINK: INCHIKEY VOXZDWNPVJITMN-LESVLKBLSA-N

AC$INSTRUMENT: API2000
AC$INSTRUMENT_TYPE: LC-APPI-QQ
AC$MASS_SPECTROMETRY: MS_TYPE MS2
AC$MASS_SPECTROMETRY: ION_MODE POSITIVE
AC$CHROMATOGRAPHY: RETENTION_TIME 0.820850 min

MS$FOCUSED_ION: BASE_PEAK 91.099998
MS$FOCUSED_ION: PRECURSOR_M/Z 255.000000
MS$FOCUSED_ION: PRECURSOR_TYPE [M-H2O+H]+

PK$SPLASH: splash10-00kf-4900000000-c5058d3761c84ca6ea3e
PK$NUM_PEAK: 210
PK$PEAK: m/z int. rel.int.
  31.500000 1350.500000 1
  38.200001 2701.000000 1
  39.000000 16206.000000 1
  40.200001 9453.500000 1
  41.084987 503736.500000 38
  42.099998 4051.500000 1
  43.125517 391645.000000 29
  43.700001 2701.000000 1
  44.500000 1350.500000 1
  49.799999 2701.000000 1
  50.400002 4051.500000 1
  50.900002 13505.000000 1
  53.120960 309264.500000 23
  55.091132 2923832.500000 218
  56.933334 8103.000000 1
  57.299999 8103.000000 1
  58.200001 1350.500000 1
  58.500000 1350.500000 1
  58.799999 4051.500000 1
  59.200001 5402.000000 1
  61.599998 1350.500000 1
  61.850000 2701.000000 1
  62.200001 1350.500000 1
  62.500000 2701.000000 1
  62.900002 6752.500000 1
  63.260000 13505.000000 1
  65.073097 1064194.000000 79
  67.132820 7283246.500000 543
  69.088484 445665.000000 33
  70.049999 2701.000000 1
  72.800003 1350.500000 1
  73.224998 5402.000000 1
  73.599998 1350.500000 1
  74.599998 4051.500000 1
  77.070177 3514001.000000 262
  79.061602 5057622.500000 377
  81.117293 2624021.500000 196
  82.400002 1350.500000 1
  82.916668 8103.000000 1
  83.400002 6752.500000 1
  86.000000 1350.500000 1
  86.500000 1350.500000 1
  86.800003 4051.500000 1
  87.199999 4051.500000 1
  87.800003 1350.500000 1
  88.000000 1350.500000 1
  91.063841 9367068.000000 699
  93.117408 698208.500000 52
  94.118987 640137.000000 48
  95.053664 1364005.000000 102
  99.149998 8103.000000 1
  99.599998 2701.000000 1
  99.900002 1350.500000 1
  100.300003 2701.000000 1
  100.800003 12154.500000 1
  101.260000 40515.000000 3
  103.074628 2363375.000000 176
  105.062009 8524356.000000 636
  107.040452 3946161.000000 294
  108.099998 8103.000000 1
  108.400002 10804.000000 1
  109.112500 151256.000000 11
  110.000000 1350.500000 1
  110.599998 2701.000000 1
  111.099998 1350.500000 1
  111.699997 2701.000000 1
  112.139998 13505.000000 1
  115.080007 11483301.500000 857
  116.138432 4926624.000000 368
  117.089978 619879.500000 46
  119.049265 183668.000000 14
  119.766668 8103.000000 1
  120.000000 12154.500000 1
  121.114634 221482.000000 17
  122.000000 1350.500000 1
  122.400002 1350.500000 1
  122.850002 2701.000000 1
  123.599998 1350.500000 1
  123.900002 2701.000000 1
  124.099998 1350.500000 1
  124.400002 2701.000000 1
  124.599998 4051.500000 1
  125.000000 10804.000000 1
  127.081004 1720537.000000 128
  128.146155 1018277.000000 76
  129.088945 1343747.500000 100
  131.131185 5006303.500000 374
  133.103941 3632845.000000 271
  134.125004 5402.000000 1
  135.100006 4051.500000 1
  135.300003 4051.500000 1
  136.300003 2701.000000 1
  136.800003 1350.500000 1
  137.800003 4051.500000 1
  138.000000 5402.000000 1
  139.109755 276852.500000 21
  141.130634 4518773.000000 337
  144.070819 13388857.000000 999
  146.186666 20257.500000 2
  147.111540 70226.000000 5
  148.100006 2701.000000 1
  148.899994 1350.500000 1
  149.300003 1350.500000 1
  149.699997 4051.500000 1
  149.899994 2701.000000 1
  150.100006 2701.000000 1
  151.984313 68875.500000 5
  153.066670 48618.000000 4
  154.100006 9453.500000 1
  154.389995 13505.000000 1
  155.039773 118844.000000 9
  157.137192 875124.000000 65
  159.117894 2218871.500000 166
  160.000000 4051.500000 1
  160.449997 2701.000000 1
  160.949997 8103.000000 1
  161.300003 5402.000000 1
  162.399994 1350.500000 1
  163.199997 2701.000000 1
  163.449997 2701.000000 1
  163.949997 2701.000000 1
  165.104880 110741.000000 8
  166.211110 24309.000000 2
  166.849998 18907.000000 1
  167.100006 13505.000000 1
  168.399994 16206.000000 1
  169.145071 191771.000000 14
  170.282351 45917.000000 3
  171.075555 60772.500000 5
  171.899994 4051.500000 1
  172.100006 2701.000000 1
  172.600006 2701.000000 1
  173.100006 12154.500000 1
  173.300003 4051.500000 1
  174.899994 1350.500000 1
  175.699997 2701.000000 1
  176.000000 1350.500000 1
  176.199997 1350.500000 1
  177.300003 1350.500000 1
  177.699997 2701.000000 1
  178.220001 13505.000000 1
  178.899994 6752.500000 1
  179.699997 4051.500000 1
  179.899994 1350.500000 1
  180.100006 2701.000000 1
  180.699997 5402.000000 1
  181.179999 13505.000000 1
  181.500000 6752.500000 1
  182.100006 8103.000000 1
  182.500000 9453.500000 1
  183.146666 40515.000000 3
  183.500000 6752.500000 1
  184.114287 18907.000000 1
  185.000000 10804.000000 1
  185.550003 2701.000000 1
  188.600006 1350.500000 1
  188.949997 2701.000000 1
  189.349998 2701.000000 1
  190.750000 2701.000000 1
  191.300003 2701.000000 1
  192.200002 4051.500000 1
  192.949997 2701.000000 1
  193.600006 2701.000000 1
  193.849998 2701.000000 1
  194.250000 5402.000000 1
  194.500000 2701.000000 1
  194.800003 2701.000000 1
  195.025002 10804.000000 1
  196.300003 5402.000000 1
  197.100003 12154.500000 1
  197.500000 6752.500000 1
  197.699997 1350.500000 1
  198.025002 5402.000000 1
  198.399994 1350.500000 1
  199.300003 1350.500000 1
  199.800003 1350.500000 1
  201.199997 1350.500000 1
  202.000000 1350.500000 1
  202.849998 2701.000000 1
  205.000000 1350.500000 1
  207.100006 1350.500000 1
  207.399994 1350.500000 1
  209.000000 1350.500000 1
  209.300003 1350.500000 1
  210.399994 2701.000000 1
  210.600006 1350.500000 1
  210.899994 2701.000000 1
  211.333333 8103.000000 1
  211.849998 2701.000000 1
  212.100006 1350.500000 1
  213.600006 1350.500000 1
  218.899994 1350.500000 1
  221.199997 1350.500000 1
  222.924995 5402.000000 1
  223.800003 2701.000000 1
  224.199997 4051.500000 1
  224.699997 4051.500000 1
  224.974998 5402.000000 1
  225.800003 4051.500000 1
  226.100006 16206.000000 1
  227.300003 1350.500000 1
  228.600006 1350.500000 1
  238.800003 2701.000000 1
  239.125004 5402.000000 1
  239.399994 1350.500000 1
  241.500000 1350.500000 1
  252.399994 5402.000000 1
  252.800003 1350.500000 1
  255.000000 1350.500000 1
  273.799988 1350.500000 1