ACCESSION: MSBNK-PFOS_research_group-FFF00366
RECORD_TITLE: 44m2PFOA; LC-ESI-QQ; MS2; CE10eV
DATE: 2016.01.19 (Created 2012.06.13)
AUTHORS: Atsushi Yamamoto
LICENSE: CC BY-SA
COPYRIGHT: PFOS.jp
COMMENT: Disclaimer: While authors make an effort to ensure that the content of this record is accurate, the authors make no representations or warranties in relation to the accuracy or completeness of the record. This record do not reflect any viewpoints of the affiliation and organization to which the authors belong.

CH$NAME: 44m2PFOA
CH$COMPOUND_CLASS: Non-Natural Product
CH$FORMULA: C8HF15O2
CH$EXACT_MASS: 413.97370
CH$SMILES: OC(=O)C(F)(F)C(F)(F)C(C(F)(F)F)(C(F)(F)F)C(F)(F)C(F)(F)F
CH$IUPAC: InChI=1S/C8HF15O2/c9-2(10,1(24)25)4(11,12)3(6(15,16)17,7(18,19)20)5(13,14)8(21,22)23/h(H,24,25)
CH$LINK: INCHIKEY UDFRHYDOIIBODA-UHFFFAOYSA-N
CH$LINK: COMPTOX DTXSID40896601

AC$INSTRUMENT: Xevo TQ, Waters
AC$INSTRUMENT_TYPE: LC-ESI-QQ
AC$MASS_SPECTROMETRY: MS_TYPE MS2
AC$MASS_SPECTROMETRY: ION_MODE NEGATIVE
AC$MASS_SPECTROMETRY: COLLISION_ENERGY 10eV
AC$CHROMATOGRAPHY: RETENTION_TIME 13.171050 min

MS$FOCUSED_ION: BASE_PEAK 269.113983
MS$FOCUSED_ION: PRECURSOR_M/Z 413
MS$FOCUSED_ION: PRECURSOR_TYPE [M-H]-

PK$SPLASH: splash10-014i-0695100000-1c8f133833ff074a4ed0
PK$NUM_PEAK: 5
PK$PEAK: m/z int. rel.int.
  118.875360 4217.224539 148
  169.196825 17766.606183 624
  269.028180 28427.656459 999
  368.763423 17088.587558 601
  412.908477 4687.884542 165