ACCESSION: MSBNK-RIKEN-PR020036
RECORD_TITLE: Cyanidin-3-glucoside; LC-ESI-QTOF; MS
DATE: 2016.01.19 (Created 2007.08.31, modified 2011.05.06)
AUTHORS: Tohge T, Plant Science Center, RIKEN.
LICENSE: CC BY-SA

CH$NAME: Cyanidin-3-glucoside
CH$NAME: Cyanidin 3-O-glucoside
CH$NAME: (2S,3R,4S,5R,6R)-2-[2-(3,4-dihydroxyphenyl)-5,7-dihydroxy-chromen-3-yl]oxy-6-(hydroxymethyl)oxane-3,4,5-triol
CH$NAME: Kuromanin
CH$NAME: Cyanidin 3-O-beta-D-glucoside
CH$COMPOUND_CLASS: N/A
CH$FORMULA: C21H21O11+
CH$EXACT_MASS: 449.10839
CH$SMILES: OC[C@@H](O1)[C@@H](O)[C@H](O)[C@@H](O)[C@@H]1Oc(c3)c([o+1]c(c4)c(c(O)cc(O)4)3)c(c2)cc(O)c(O)c2
CH$IUPAC: InChI=1S/C21H20O11/c22-7-16-17(27)18(28)19(29)21(32-16)31-15-6-10-12(25)4-9(23)5-14(10)30-20(15)8-1-2-11(24)13(26)3-8/h1-6,16-19,21-22,27-29H,7H2,(H3-,23,24,25,26)/p+1/t16-,17-,18+,19-,21-/m1/s1
CH$LINK: CAS 7084-24-4
CH$LINK: KEGG C08604
CH$LINK: NIKKAJI J231.541F
CH$LINK: PUBCHEM SID:10797 CID:441667
CH$LINK: INCHIKEY RKWHWFONKJEUEF-GQUPQBGVSA-O

AC$INSTRUMENT: UPLC Q-Tof Premier, Waters
AC$INSTRUMENT_TYPE: LC-ESI-QTOF
AC$MASS_SPECTROMETRY: MS_TYPE MS
AC$MASS_SPECTROMETRY: ION_MODE POSITIVE
AC$MASS_SPECTROMETRY: COLLISION_ENERGY 5.0 V
AC$MASS_SPECTROMETRY: DATAFORMAT Centroid
AC$MASS_SPECTROMETRY: DESOLVATION_GAS_FLOW 600.0 L/Hr
AC$MASS_SPECTROMETRY: DESOLVATION_TEMPERATURE 350 C
AC$MASS_SPECTROMETRY: FRAGMENTATION_MODE LOW-ENERGY CID
AC$MASS_SPECTROMETRY: IONIZATION ESI
AC$MASS_SPECTROMETRY: SCANNING 0.6 sec/scan (m/z = 200-1200)
AC$MASS_SPECTROMETRY: SOURCE_TEMPERATURE 100 C
AC$CHROMATOGRAPHY: CAPILLARY_VOLTAGE 3.0 kV
AC$CHROMATOGRAPHY: COLUMN_NAME ACQUITY UPLC BEH C18 2.1 by 100 mm (Waters, Milford, MA,USA)
AC$CHROMATOGRAPHY: COLUMN_TEMPERATURE 35 C
AC$CHROMATOGRAPHY: FLOW_GRADIENT 0/100 at 0 min, 15/85 at 5 min, 21/79 at 20 min, 90/10 at 24 min, 95/5 at 26 min, 0/100, 30 min.
AC$CHROMATOGRAPHY: FLOW_RATE 0.5 ml/min
AC$CHROMATOGRAPHY: RETENTION_TIME 6.18 min
AC$CHROMATOGRAPHY: SAMPLING_CONE 23.0 V
AC$CHROMATOGRAPHY: SOLVENT A CH3CN(0.1%TFA)
AC$CHROMATOGRAPHY: SOLVENT B H2O(0.1%TFA)

MS$FOCUSED_ION: FULL_SCAN_FRAGMENT_ION_PEAK 449
MS$FOCUSED_ION: ION_TYPE [M]+
MS$DATA_PROCESSING: FIND_PEAK ignore rel.int. < 10
MS$DATA_PROCESSING: WHOLE MassLynx 4.1

PK$SPLASH: splash10-0002-0000900000-7e1fd668debbf8e25d3f
PK$NUM_PEAK: 5
PK$PEAK: m/z int. rel.int.
  449.1161 8352 999
  450.1392 1225 147
  451.1346 307.7 37
  452.1257 105.9 13
  897.2520 92.30 11