ACCESSION: MSBNK-RIKEN-PR030015
RECORD_TITLE: L-(-)-Proline; CE-ESI-TOF; MS; [M+H]+
DATE: 2016.01.19 (Created 2007.12.03, modified 2011.05.06)
AUTHORS: Oikawa A, Plant Science Center, RIKEN.
LICENSE: CC BY-SA

CH$NAME: L-Proline
CH$NAME: 2-Pyrrolidinecarboxylic acid
CH$NAME: L-(-)-Proline
CH$COMPOUND_CLASS: N/A
CH$FORMULA: C5H9NO2
CH$EXACT_MASS: 115.06333
CH$SMILES: OC(=O)C([H])(C1)NCC1
CH$IUPAC: InChI=1S/C5H9NO2/c7-5(8)4-2-1-3-6-4/h4,6H,1-3H2,(H,7,8)/t4-/m0/s1
CH$LINK: CAS 147-85-3
CH$LINK: CHEBI 17203
CH$LINK: CHEMPDB PRO
CH$LINK: KEGG C00148
CH$LINK: NIKKAJI J9.117K
CH$LINK: PUBCHEM 3448
CH$LINK: INCHIKEY ONIBWKKTOPOVIA-BYPYZUCNSA-N
CH$LINK: COMPTOX DTXSID5044021

AC$INSTRUMENT: CE-system connected to 6210 Time-of-Flight MS, Agilent
AC$INSTRUMENT_TYPE: CE-ESI-TOF
AC$MASS_SPECTROMETRY: MS_TYPE MS
AC$MASS_SPECTROMETRY: ION_MODE POSITIVE
AC$MASS_SPECTROMETRY: DRY_GAS_FLOW 7 L/min
AC$MASS_SPECTROMETRY: DRY_GAS_TEMP 300 C
AC$MASS_SPECTROMETRY: FRAGMENT_VOLTAGE 110 V
AC$MASS_SPECTROMETRY: IONIZATION ESI
AC$MASS_SPECTROMETRY: NEBULIZER 0/10/10 psig
AC$MASS_SPECTROMETRY: OCTPOLE_VOLTAGE 160 V
AC$MASS_SPECTROMETRY: SCANNING_CYCLE 1.5 cycle/sec
AC$MASS_SPECTROMETRY: SCANNING_RANGE m/z 50-1000
AC$MASS_SPECTROMETRY: SKIMMER_VOLTAGE 50 V
AC$CHROMATOGRAPHY: ANALYTICAL_TIME 30 min
AC$CHROMATOGRAPHY: CAPILLARY_VOLTAGE 4000 V
AC$CHROMATOGRAPHY: COLUMN_NAME Fused sillica capillary id=50 um L=100 cm (HMT Inc., Tsuruoka, Japan)
AC$CHROMATOGRAPHY: COLUMN_TEMPERATURE 20 C
AC$CHROMATOGRAPHY: FLOW_RATE 10 uL/min
AC$CHROMATOGRAPHY: INTERNAL_STANDARD 1. 200 uM Methionine sulfone, 2. 200 uM 3-Aminopyrrolidine
AC$CHROMATOGRAPHY: INTERNAL_STANDARD_MT 1. 16.56 min, 2. 6.40 min
AC$CHROMATOGRAPHY: MIGRATION_TIME 15.11 min
AC$CHROMATOGRAPHY: PRECONDITIONING 4 min
AC$CHROMATOGRAPHY: RUNNING_BUFFER 1 M Formic acid
AC$CHROMATOGRAPHY: RUNNING_VOLTAGE 30 kV
AC$CHROMATOGRAPHY: SAMPLE_INJECTION 15 sec 50 mbar
AC$CHROMATOGRAPHY: SHEATH_LIQUID Methanol-water (50% v/v) containing 0.5 uM reserpine
AC$CHROMATOGRAPHY: TIME_PROGRAM 0/0.25/1 min
AC$CHROMATOGRAPHY: WASHING_BUFFER 1 M Formic acid

MS$FOCUSED_ION: ION_TYPE [M+H]+
MS$DATA_PROCESSING: WHOLE Analyst QS 1.1

PK$SPLASH: splash10-014i-0900000000-ef038c77922e4c89eeb0
PK$NUM_PEAK: 1
PK$PEAK: m/z int. rel.int.
  116.0692 112117.0 999