ACCESSION: MSBNK-RIKEN-PR306769
RECORD_TITLE: Quercetin-3-O-xyloside; LC-ESI-QTOF; MS2
DATE: 2019.03.28
AUTHORS: Tetsuya Mori, Center for Sustainable Resource Science, RIKEN
LICENSE: CC BY-NC-SA
PUBLICATION: Tsugawa H., Nakabayashi R., Mori T., Yamada Y., Takahashi M., Rai A., Sugiyama R., Yamamoto H., Nakaya T., Yamazaki M., Kooke R., Bac-Molenaar JA., Oztolan-Erol N., Keurentjes JJB., Arita M., Saito K. (2019) "A cheminformatics approach to characterize metabolomes in stable-isotope-labeled organisms" Nature Methods 16(4):295-298. [doi:10.1038/s41592-019-0358-2]
COMMENT: registered in RIKEN PlaSMA

CH$NAME: Quercetin-3-O-xyloside
CH$COMPOUND_CLASS: Flavonoid-3-O-glycosides
CH$FORMULA: C20H18O11
CH$EXACT_MASS: 434.353
CH$SMILES: OC1COC(OC2=C(OC3=CC(O)=CC(O)=C3C2=O)C2=CC(O)=C(O)C=C2)C(O)C1O
CH$IUPAC: InChI=1S/C20H18O11/c21-8-4-11(24)14-13(5-8)30-18(7-1-2-9(22)10(23)3-7)19(16(14)27)31-20-17(28)15(26)12(25)6-29-20/h1-5,12,15,17,20-26,28H,6H2
CH$LINK: INCHIKEY PZZRDJXEMZMZFD-UHFFFAOYSA-N

AC$INSTRUMENT: LC, Waters Acquity UPLC System; MS, Waters Xevo G2 Q-Tof
AC$INSTRUMENT_TYPE: LC-ESI-QTOF
AC$MASS_SPECTROMETRY: MS_TYPE MS2
AC$MASS_SPECTROMETRY: ION_MODE NEGATIVE
AC$MASS_SPECTROMETRY: COLLISION_ENERGY 6V
AC$MASS_SPECTROMETRY: DESOLVATION_GAS_FLOW 800/h
AC$MASS_SPECTROMETRY: DESOLVATION_TEMPERATURE 450 C
AC$MASS_SPECTROMETRY: IONIZATION ESI
AC$CHROMATOGRAPHY: CAPILLARY_VOLTAGE -2.75 kV
AC$CHROMATOGRAPHY: COLUMN_NAME Acquity bridged ethyl hybrid C18 (1.7 um, 2.1 mm * 100 mm, Waters)
AC$CHROMATOGRAPHY: COLUMN_TEMPERATURE 40 C
AC$CHROMATOGRAPHY: FLOW_GRADIENT A/B = (99.5%/0.5% at 0 min, 99.5%/0.5% at 0.1 min, 20%/80% at 10 min, 0.5%/99.5% at 10.1 min, 0.5%/99.5% at 12.0 min, 99.5%/0.5% at 12.1 min, 99.5%/0.5% at 15.0 min)
AC$CHROMATOGRAPHY: FLOW_RATE 0.3 ml/min at 0 min, 0.3 ml/min at 10 min, 0.4 ml/min at 10.1 min, 0.4 ml/min at 14.4 min, 0.3 ml/min at 14.5 min
AC$CHROMATOGRAPHY: RETENTION_TIME 4.164767
AC$CHROMATOGRAPHY: SOLVENT A water including 0.1% formic acid
AC$CHROMATOGRAPHY: SOLVENT B acetonitrile including 0.1% formic acid

MS$FOCUSED_ION: PRECURSOR_TYPE [M-H]-
MS$FOCUSED_ION: PRECURSOR_M/Z 433.07763494783

PK$SPLASH: splash10-0uk9-0197000000-56994ae8c01fc0e36da8
PK$NUM_PEAK: 45
PK$PEAK: m/z int. rel.int.
  107.00719 8.0 8
  121.0265 12.0 12
  135.00435 6.0 6
  136.01804 5.0 5
  149.02713 7.0 7
  151.00159 161.0 161
  152.00511 18.0 18
  163.00139 44.0 44
  164.00774 10.0 10
  178.99757 35.0 35
  180.00829 7.0 7
  187.04607 11.0 11
  211.03949 11.0 11
  214.02731 10.0 10
  215.0294 6.0 6
  216.03903 13.0 13
  226.02177 15.0 15
  227.03192 35.0 35
  229.04518 17.0 17
  239.02876 21.0 21
  239.04591 5.0 5
  241.01013 13.0 13
  242.02209 29.0 29
  243.02573 131.0 131
  244.03078 18.0 18
  245.03325 7.0 7
  245.04234 24.0 24
  254.01868 37.0 37
  255.02913 344.0 344
  256.0325 49.0 49
  257.04352 12.0 12
  270.01178 11.0 11
  270.0206 17.0 17
  271.0231 676.0 675
  272.01346 17.0 17
  272.02771 119.0 119
  273.03235 30.0 30
  273.05365 18.0 18
  273.77869 5.0 5
  283.02594 14.0 14
  299.02097 25.0 25
  300.0267 1000.0 999
  301.03156 338.0 338
  302.03461 73.0 73
  303.04794 7.0 7