ACCESSION: MSBNK-RIKEN_ReSpect-PS068303
RECORD_TITLE: S-Pyruvoylglutathione, S-Lactoylglutathione, S-Pyruvylglutathione; LC-ESI-QQ; MS2
DATE: 2009.02.09
AUTHORS: Sawada Y, Matsuda F, and Hirai MY. Plant Science Center, RIKEN
LICENSE: CC BY-NC
COPYRIGHT: Copyright(C) 2008 Plant Science Center, RIKEN
PUBLICATION: Sawada, Y.; Akiyama, K.; Sakata, A.; Kuwahara, A.; Otsuki, H.; Sakurai, T.; Saito, K.; Hirai, M. Y. Widely Targeted Metabolomics Based on Large-Scale MS/MS Data for Elucidating Metabolite Accumulation Patterns in Plants. Plant and Cell Physiology 2008, 50 (1), 37–47. DOI:10.1093/pcp/pcn183
COMMENT: Build 5
COMMENT: Data acquisition and generation is financially supported in part by CREST/JST.
COMMENT: Source compound SIGMA, L7140.
COMMENT: PRIMe compound in-house ID S0074
COMMENT: This spectra was automatically generated from the raw data without manual curation of data quality.
COMMENT: The spectral data and services are available to the research and academic community only.
COMMENT: All users must cite follwing literature in publication(s).

CH$NAME: S-Pyruvoylglutathione
CH$NAME: S-Lactoylglutathione
CH$NAME: S-Pyruvylglutathione
CH$COMPOUND_CLASS: CLASS1 Amino acid CLASS2 Peptide CLASS3 Oligopeptide
CH$FORMULA: C13H21N3O8S
CH$EXACT_MASS: 379.389
CH$SMILES: CC(C(=O)SCC(C(=O)NCC(=O)O)NC(=O)CCC(C(=O)O)N)O
CH$IUPAC: InChI=1S/C13H21N3O8S/c1-6(17)13(24)25-5-8(11(21)15-4-10(19)20)16-9(18)3-2-7(14)12(22)23/h6-8,17H,2-5,14H2,1H3,(H,15,21)(H,16,18)(H,19,20)(H,22,23)
CH$LINK: CAS 25138-66-3
CH$LINK: KEGG C03451
CH$LINK: PUBCHEM CID:440018
CH$LINK: INCHIKEY VDYDCVUWILIYQF-UHFFFAOYSA-N

AC$INSTRUMENT: TQD, Waters
AC$INSTRUMENT_TYPE: LC-ESI-QQ
AC$MASS_SPECTROMETRY: MS_TYPE MS2
AC$MASS_SPECTROMETRY: ION_MODE POSITIVE
AC$MASS_SPECTROMETRY: IONIZATION ESI
AC$MASS_SPECTROMETRY: COLLISION_ENERGY 30

MS$FOCUSED_ION: ION_TYPE [M+H]+
MS$FOCUSED_ION: PRECURSOR_M/Z 380.35

PK$SPLASH: splash10-000t-1940000000-28e6acda66edd3b0146f
PK$NUM_PEAK: 16
PK$PEAK: m/z int. rel.int.
  76.0 9334.0 220
  84.0 3554.0 84
  129.0 3602.0 85
  130.0 10927.0 258
  147.0 12831.0 303
  148.0 42314.0 999
  162.0 3690.0 87
  175.0 3570.0 84
  176.0 7129.0 168
  178.0 4497.0 106
  179.0 6192.0 146
  232.0 7140.0 169
  233.0 35405.0 836
  305.0 2564.0 61
  379.0 2404.0 57
  380.0 1782.0 42