ACCESSION: MSBNK-RIKEN_ReSpect-PT210900
RECORD_TITLE: 1-Methoxy-3-formylindole, 3-Formyl-1-methoxyindole, 1-Methoxy-3-carbaldehyde, 1-methoxyindole-3-carbaldehyde; LC-ESI-QTOF; MS2
DATE: 2008.09.29
AUTHORS: Matsuda F, Suzuki M, Sawada Y, Plant Science Center, RIKEN.
LICENSE: CC BY-NC
COPYRIGHT: Copyright(C) 2009 Plant Science Center, RIKEN
COMMENT: Build 1 2009/06/24
COMMENT: Acquisition and generation of the data is financially supported in part by CREST/JST.

CH$NAME: 1-Methoxy-3-formylindole
CH$NAME: 3-Formyl-1-methoxyindole
CH$NAME: 1-Methoxy-3-carbaldehyde
CH$NAME: 1-methoxyindole-3-carbaldehyde
CH$COMPOUND_CLASS: CLASS1 Alkaloid CLASS2 Indole CLASS3 Indole
CH$FORMULA: C10H9NO2
CH$EXACT_MASS: 175.187
CH$SMILES: CON1C=C(C2=CC=CC=C21)C=O
CH$IUPAC: InChI=1S/C10H9NO2/c1-13-11-6-8(7-12)9-4-2-3-5-10(9)11/h2-7H,1H3
CH$LINK: CAS 67282-55-7
CH$LINK: INCHIKEY NFGIENSPALNOON-UHFFFAOYSA-N

AC$INSTRUMENT: Q-Tof Premier, Waters
AC$INSTRUMENT_TYPE: LC-ESI-QTOF
AC$MASS_SPECTROMETRY: MS_TYPE MS2
AC$MASS_SPECTROMETRY: ION_MODE NEGATIVE
AC$MASS_SPECTROMETRY: IONIZATION ESI
AC$MASS_SPECTROMETRY: COLLISION_ENERGY Ramp 5-45 V
AC$MASS_SPECTROMETRY: CAPILLARY_VOLTAGE 3.0 kV
AC$CHROMATOGRAPHY: SOLVENT CH3CN/H2O

MS$FOCUSED_ION: ION_TYPE [M-H]-
MS$FOCUSED_ION: PRECURSOR_M/Z 174.05551

PK$SPLASH: splash10-0a4i-0900000000-47067e7f0ea5a079a2cb
PK$NUM_PEAK: 4
PK$PEAK: m/z int. rel.int.
  131.0385 8.173 180
  143.8994 2.867 63
  159.0339 45.36 999
  174.0555 19.03 419