ACCESSION: MSBNK-Washington_State_Univ-BML80332
RECORD_TITLE: 3',4'-Dimethoxy-3-hydroxy-6-methylflavone; LC-APCI-QTOF; MS; POSITIVE
DATE: 2016.01.19 (Created 2012.10.26)
AUTHORS: Cuthbertson DJ, Johnson SR, Lange BM, Institute of Biological Chemistry, Washington State University
LICENSE: CC BY-SA
COMMENT: relative retention time with respect to 9-anthracene Carboxylic Acid is 1.320

CH$NAME: 3',4'-Dimethoxy-3-hydroxy-6-methylflavone
CH$COMPOUND_CLASS: N/A
CH$FORMULA: C18H16O5
CH$EXACT_MASS: 312.099774
CH$SMILES: CC1=CC2=C(C=C1)OC(=C(C2=O)O)C3=CC(=C(C=C3)OC)OC
CH$IUPAC: InChI=1S/C18H16O5/c1-10-4-6-13-12(8-10)16(19)17(20)18(23-13)11-5-7-14(21-2)15(9-11)22-3/h4-9,20H,1-3H3
CH$LINK: CHEMSPIDER 600244
CH$LINK: PUBCHEM CID:688844
CH$LINK: INCHIKEY SMDGCFJQVYCATD-UHFFFAOYSA-N
CH$LINK: COMPTOX DTXSID10350982

AC$INSTRUMENT: Agilent 1200 RRLC; Agilent 6520 QTOF
AC$INSTRUMENT_TYPE: LC-APCI-QTOF
AC$MASS_SPECTROMETRY: MS_TYPE MS
AC$MASS_SPECTROMETRY: ION_MODE POSITIVE
AC$MASS_SPECTROMETRY: SCANNING m/z 100-1000
AC$CHROMATOGRAPHY: COLUMN_NAME Agilent C8 Cartridge Column 2.1X30mm 3.5 micron (guard); Agilent SB-Aq 2.1x50mm 1.8 micron (analytical)
AC$CHROMATOGRAPHY: COLUMN_TEMPERATURE 60 C
AC$CHROMATOGRAPHY: FLOW_GRADIENT linear from 98A/2B at 0 min to 2A/98B at 13 min, hold 6 min at 2A/98B, reequilibration 98A/2B (5 min)
AC$CHROMATOGRAPHY: FLOW_RATE 0.6 ml/min
AC$CHROMATOGRAPHY: RETENTION_TIME 9.724
AC$CHROMATOGRAPHY: SOLVENT A water with 0.2% acetic acid
AC$CHROMATOGRAPHY: SOLVENT B methanol with 0.2% acetic acid

PK$SPLASH: splash10-03di-0009000000-5cc2a34e359a42ca0f5d
PK$NUM_PEAK: 1
PK$PEAK: m/z int. rel.int.
  313.1070765 611406 999