ACCESSION: MSBNK-Washington_State_Univ-BML80695
RECORD_TITLE: Adenosine 5'-succinate; LC-ESI-QTOF; MS; POSITIVE
DATE: 2016.01.19 (Created 2012.10.26)
AUTHORS: Cuthbertson DJ, Johnson SR, Lange BM, Institute of Biological Chemistry, Washington State University
LICENSE: CC BY-SA
COMMENT: relative retention time with respect to 9-anthracene Carboxylic Acid is 0.417

CH$NAME: Adenosine 5'-succinate
CH$COMPOUND_CLASS: N/A
CH$FORMULA: C14H17N5O7
CH$EXACT_MASS: 367.112798
CH$SMILES: C1=NC2=C(C(=N1)N)N=CN2C3C(C(C(O3)COC(=O)CCC(=O)O)O)O
CH$IUPAC: InChI=1S/C14H17N5O7/c15-12-9-13(17-4-16-12)19(5-18-9)14-11(24)10(23)6(26-14)3-25-8(22)2-1-7(20)21/h4-6,10-11,14,23-24H,1-3H2,(H,20,21)(H2,15,16,17)
CH$LINK: CAS 102029-71-0
CH$LINK: CHEMSPIDER 2569684
CH$LINK: PUBCHEM CID:3322184
CH$LINK: INCHIKEY SOVSEJILHKLDOS-UHFFFAOYSA-N

AC$INSTRUMENT: Agilent 1200 RRLC; Agilent 6520 QTOF
AC$INSTRUMENT_TYPE: LC-ESI-QTOF
AC$MASS_SPECTROMETRY: MS_TYPE MS
AC$MASS_SPECTROMETRY: ION_MODE POSITIVE
AC$MASS_SPECTROMETRY: SCANNING m/z 100-1000
AC$CHROMATOGRAPHY: COLUMN_NAME Agilent C8 Cartridge Column 2.1X30mm 3.5 micron (guard); Agilent SB-Aq 2.1x50mm 1.8 micron (analytical)
AC$CHROMATOGRAPHY: COLUMN_TEMPERATURE 60 C
AC$CHROMATOGRAPHY: FLOW_GRADIENT linear from 98A/2B at 0 min to 2A/98B at 13 min, hold 6 min at 2A/98B, reequilibration 98A/2B (5 min)
AC$CHROMATOGRAPHY: FLOW_RATE 0.6 ml/min
AC$CHROMATOGRAPHY: RETENTION_TIME 3.052
AC$CHROMATOGRAPHY: SOLVENT A water with 0.2% acetic acid
AC$CHROMATOGRAPHY: SOLVENT B methanol with 0.2% acetic acid

PK$SPLASH: splash10-014i-0009000000-da5355f046e771ec7bed
PK$NUM_PEAK: 2
PK$PEAK: m/z int. rel.int.
  368.1200765 637152 999
  390.102018 8245 13