ACCESSION: MSBNK-Waters-WA000726
RECORD_TITLE: Oxazepam; LC-ESI-Q; MS; POS; 60 V
DATE: 2016.01.19 (Created 2007.08.01, modified 2011.05.06)
AUTHORS: Nihon Waters K.K.
LICENSE: CC BY-NC

CH$NAME: Oxazepam
CH$COMPOUND_CLASS: N/A
CH$FORMULA: C15H11ClN2O2
CH$EXACT_MASS: 286.05091
CH$SMILES: Clc(c3)cc(c(c3)2)C(=NC(O)C(=O)N2)c(c1)cccc1
CH$IUPAC: InChI=1S/C15H11ClN2O2/c16-10-6-7-12-11(8-10)13(9-4-2-1-3-5-9)18-15(20)14(19)17-12/h1-8,15,20H,(H,17,19)/t15-/m0/s1
CH$LINK: CAS 604-75-1
CH$LINK: INCHIKEY ADIMAYPTOBDMTL-HNNXBMFYSA-N

AC$INSTRUMENT: ZQ, Waters
AC$INSTRUMENT_TYPE: LC-ESI-Q
AC$MASS_SPECTROMETRY: MS_TYPE MS
AC$MASS_SPECTROMETRY: ION_MODE POSITIVE
AC$MASS_SPECTROMETRY: IONIZATION ESI
AC$CHROMATOGRAPHY: RETENTION_TIME 15.100 min
AC$CHROMATOGRAPHY: COLUMN_NAME 2.1 mm id - 3. 5{mu}m XTerra C18MS
AC$CHROMATOGRAPHY: COLUMN_TEMPERATURE 35 C
AC$CHROMATOGRAPHY: SAMPLING_CONE 60 V

MS$DATA_PROCESSING: FIND_PEAK ignore rel.int. < 5

PK$SPLASH: splash10-0f6x-0590000000-63625bf1677522c86056
PK$NUM_PEAK: 63
PK$PEAK: m/z int. rel.int.
  104 701 701
  105 31 31
  118 20 20
  122 8 8
  128 262 262
  129 12 12
  130 43 43
  138 16 16
  145 35 35
  153 110 110
  154 8 8
  155 35 35
  156 20 20
  158 8 8
  163 47 47
  165 16 16
  166 47 47
  168 12 12
  169 8 8
  181 8 8
  194 12 12
  195 24 24
  196 8 8
  207 35 35
  214 12 12
  216 12 12
  229 24 24
  231 357 357
  232 39 39
  233 125 125
  234 8 8
  241 999 999
  242 20 20
  243 360 360
  244 51 51
  257 35 35
  258 8 8
  259 16 16
  269 200 200
  270 31 31
  271 71 71
  272 8 8
  287 118 118
  288 16 16
  289 43 43
  290 8 8
  291 8 8
  309 110 110
  310 12 12
  311 39 39
  325 47 47
  327 24 24
  350 12 12
  352 8 8
  573 12 12
  575 8 8
  595 59 59
  596 16 16
  597 43 43
  598 12 12
  599 8 8
  611 12 12
  613 12 12