ACCESSION: MSBNK-Waters-WA000780
RECORD_TITLE: Ethyl Loflazepate; LC-ESI-Q; MS; POS; 15 V, 30 V
DATE: 2016.01.19 (Created 2007.08.01, modified 2012.05.21)
AUTHORS: Nihon Waters K.K.
LICENSE: CC BY-NC

CH$NAME: Ethyl Loflazepate
CH$COMPOUND_CLASS: N/A
CH$FORMULA: C18H14ClFN2O3
CH$EXACT_MASS: 360.06770
CH$SMILES: CCOC(=O)C(C(=O)1)N=C(c(c3)c(F)ccc3)c(c2)c(ccc(Cl)2)N1
CH$IUPAC: InChI=1S/C18H14ClFN2O3/c1-2-25-18(24)16-17(23)21-14-8-7-10(19)9-12(14)15(22-16)11-5-3-4-6-13(11)20/h3-9,16H,2H2,1H3,(H,21,23)
CH$LINK: CAS 29177-84-2
CH$LINK: INCHIKEY CUCHJCMWNFEYOM-UHFFFAOYSA-N

AC$INSTRUMENT: ZQ, Waters
AC$INSTRUMENT_TYPE: LC-ESI-Q
AC$MASS_SPECTROMETRY: MS_TYPE MS
AC$MASS_SPECTROMETRY: ION_MODE POSITIVE
AC$MASS_SPECTROMETRY: IONIZATION ESI
AC$CHROMATOGRAPHY: RETENTION_TIME 17.400 min
AC$CHROMATOGRAPHY: COLUMN_NAME 2.1 mm id - 3. 5{mu}m XTerra C18MS
AC$CHROMATOGRAPHY: COLUMN_TEMPERATURE 35 C
AC$CHROMATOGRAPHY: SAMPLING_CONE 15 V, 30 V

MS$DATA_PROCESSING: FIND_PEAK ignore rel.int. < 5

PK$SPLASH: splash10-03di-0009000000-3dadb6b165dbeb8a482d
PK$ANNOTATION: m/z type
  361 [M+H]+
  383 [M+Na]+
PK$NUM_PEAK: 6
PK$PEAK: m/z int. rel.int.
  361 999 999
  362 153 153
  363 376 376
  364 51 51
  383 8 8
  399 12 12