ACCESSION: MSBNK-Waters-WA000829
RECORD_TITLE: Doxapram; LC-ESI-Q; MS; POS; 75 V
DATE: 2016.01.19 (Created 2007.08.01, modified 2011.05.06)
AUTHORS: Nihon Waters K.K.
LICENSE: CC BY-NC

CH$NAME: Doxapram
CH$COMPOUND_CLASS: N/A
CH$FORMULA: C24H30N2O2
CH$EXACT_MASS: 378.23073
CH$SMILES: C(c(c4)cccc4)(c(c3)cccc3)(C(=O)1)C(CCN(C2)CCOC2)CN(CC)1
CH$IUPAC: InChI=1S/C24H30N2O2/c1-2-26-19-22(13-14-25-15-17-28-18-16-25)24(23(26)27,20-9-5-3-6-10-20)21-11-7-4-8-12-21/h3-12,22H,2,13-19H2,1H3
CH$LINK: CAS 309-29-5
CH$LINK: INCHIKEY XFDJYSQDBULQSI-UHFFFAOYSA-N
CH$LINK: COMPTOX DTXSID2022963

AC$INSTRUMENT: ZQ, Waters
AC$INSTRUMENT_TYPE: LC-ESI-Q
AC$MASS_SPECTROMETRY: MS_TYPE MS
AC$MASS_SPECTROMETRY: ION_MODE POSITIVE
AC$MASS_SPECTROMETRY: IONIZATION ESI
AC$CHROMATOGRAPHY: RETENTION_TIME 12.700 min
AC$CHROMATOGRAPHY: COLUMN_NAME 2.1 mm id - 3. 5{mu}m XTerra C18MS
AC$CHROMATOGRAPHY: COLUMN_TEMPERATURE 35 C
AC$CHROMATOGRAPHY: SAMPLING_CONE 75 V

MS$DATA_PROCESSING: FIND_PEAK ignore rel.int. < 5

PK$SPLASH: splash10-00mo-0920000000-d0bfc1b3e4b34d84ea2e
PK$NUM_PEAK: 57
PK$PEAK: m/z int. rel.int.
  100 204 204
  101 8 8
  103 8 8
  105 168 168
  106 8 8
  110 16 16
  112 8 8
  115 31 31
  117 251 251
  118 16 16
  126 8 8
  128 63 63
  129 925 925
  130 67 67
  131 20 20
  132 16 16
  140 20 20
  141 27 27
  143 999 999
  144 82 82
  145 8 8
  155 8 8
  157 74 74
  158 16 16
  160 12 12
  165 16 16
  167 878 878
  168 102 102
  169 12 12
  172 16 16
  173 12 12
  178 8 8
  179 12 12
  186 35 35
  188 24 24
  193 12 12
  195 55 55
  196 8 8
  200 20 20
  201 39 39
  204 12 12
  207 51 51
  208 8 8
  210 8 8
  214 27 27
  219 16 16
  221 8 8
  264 396 396
  265 63 63
  274 12 12
  292 505 505
  293 86 86
  294 16 16
  379 223 223
  380 47 47
  401 16 16
  417 8 8