ACCESSION: MSBNK-Waters-WA000870
RECORD_TITLE: 11-Nor-9-carboxy-Delta9-THC; LC-ESI-Q; MS; POS; 30 V
DATE: 2016.01.19 (Created 2007.08.01, modified 2011.05.06)
AUTHORS: Nihon Waters K.K.
LICENSE: CC BY-NC

CH$NAME: 11-Nor-9-carboxy-Delta9-THC
CH$COMPOUND_CLASS: N/A
CH$FORMULA: C21H28O4
CH$EXACT_MASS: 344.19876
CH$SMILES: CCCCCc(c3)cc(O1)c(c(O)3)C([H])(C=2)C([H])(CCC(C(O)=O)2)C(C)(C)1
CH$IUPAC: InChI=1S/C21H28O4/c1-4-5-6-7-13-10-17(22)19-15-12-14(20(23)24)8-9-16(15)21(2,3)25-18(19)11-13/h10-12,15-16,22H,4-9H2,1-3H3,(H,23,24)/t15-,16-/m1/s1
CH$LINK: CAS 56354-06-4
CH$LINK: INCHIKEY YOVRGSHRZRJTLZ-HZPDHXFCSA-N
CH$LINK: COMPTOX DTXSID20204907

AC$INSTRUMENT: ZQ, Waters
AC$INSTRUMENT_TYPE: LC-ESI-Q
AC$MASS_SPECTROMETRY: MS_TYPE MS
AC$MASS_SPECTROMETRY: ION_MODE POSITIVE
AC$MASS_SPECTROMETRY: IONIZATION ESI
AC$CHROMATOGRAPHY: RETENTION_TIME 19.300 min
AC$CHROMATOGRAPHY: COLUMN_NAME 2.1 mm id - 3. 5{mu}m XTerra C18MS
AC$CHROMATOGRAPHY: COLUMN_TEMPERATURE 35 C
AC$CHROMATOGRAPHY: SAMPLING_CONE 30 V

MS$DATA_PROCESSING: FIND_PEAK ignore rel.int. < 5

PK$SPLASH: splash10-0002-0009000000-ba8a7d1cf04037050ff0
PK$NUM_PEAK: 9
PK$PEAK: m/z int. rel.int.
  83 8 8
  299 8 8
  311 8 8
  327 223 223
  328 55 55
  329 8 8
  345 999 999
  346 180 180
  347 31 31