ACCESSION: MSBNK-Waters-WA000877
RECORD_TITLE: 11-Hydroxy-Delta9-THC; LC-ESI-Q; MS; POS; 15 V
DATE: 2016.01.19 (Created 2007.08.01, modified 2011.05.06)
AUTHORS: Nihon Waters K.K.
LICENSE: CC BY-NC

CH$NAME: 11-Hydroxy-Delta9-THC
CH$COMPOUND_CLASS: N/A
CH$FORMULA: C21H30O3
CH$EXACT_MASS: 330.21949
CH$SMILES: CCCCCc(c3)cc(O1)c(c(O)3)C([H])(C=2)C([H])(CCC(CO)2)C(C)(C)1
CH$IUPAC: InChI=1S/C21H30O3/c1-4-5-6-7-14-11-18(23)20-16-10-15(13-22)8-9-17(16)21(2,3)24-19(20)12-14/h10-12,16-17,22-23H,4-9,13H2,1-3H3/t16-,17-/m1/s1
CH$LINK: CAS 36557-05-8
CH$LINK: INCHIKEY YCBKSSAWEUDACY-IAGOWNOFSA-N
CH$LINK: COMPTOX DTXSID50190061

AC$INSTRUMENT: ZQ, Waters
AC$INSTRUMENT_TYPE: LC-ESI-Q
AC$MASS_SPECTROMETRY: MS_TYPE MS
AC$MASS_SPECTROMETRY: ION_MODE POSITIVE
AC$MASS_SPECTROMETRY: IONIZATION ESI
AC$CHROMATOGRAPHY: RETENTION_TIME 19.180 min
AC$CHROMATOGRAPHY: COLUMN_NAME 2.1 mm id - 3. 5{mu}m XTerra C18MS
AC$CHROMATOGRAPHY: COLUMN_TEMPERATURE 35 C
AC$CHROMATOGRAPHY: SAMPLING_CONE 15 V

MS$DATA_PROCESSING: FIND_PEAK ignore rel.int. < 5

PK$SPLASH: splash10-001i-0009000000-5e4b2ef36634b3c67ecc
PK$NUM_PEAK: 7
PK$PEAK: m/z int. rel.int.
  100 12 12
  167 8 8
  313 43 43
  315 12 12
  331 999 999
  332 266 266
  333 16 16