ACCESSION: MSBNK-Waters-WA000905
RECORD_TITLE: Alprazolam; LC-ESI-Q; MS; POS; 15 V, 30 V
DATE: 2016.01.19 (Created 2007.08.01, modified 2011.05.06)
AUTHORS: Nihon Waters K.K.
LICENSE: CC BY-NC

CH$NAME: Alprazolam
CH$COMPOUND_CLASS: N/A
CH$FORMULA: C17H13ClN4
CH$EXACT_MASS: 308.08287
CH$SMILES: Clc(c3)cc(C=1c(c4)cccc4)c(c3)n(c(C)2)c(nn2)CN1
CH$IUPAC: InChI=1S/C17H13ClN4/c1-11-20-21-16-10-19-17(12-5-3-2-4-6-12)14-9-13(18)7-8-15(14)22(11)16/h2-9H,10H2,1H3
CH$LINK: CAS 28981-97-7
CH$LINK: INCHIKEY VREFGVBLTWBCJP-UHFFFAOYSA-N
CH$LINK: COMPTOX DTXSID4022577

AC$INSTRUMENT: ZQ, Waters
AC$INSTRUMENT_TYPE: LC-ESI-Q
AC$MASS_SPECTROMETRY: MS_TYPE MS
AC$MASS_SPECTROMETRY: ION_MODE POSITIVE
AC$MASS_SPECTROMETRY: IONIZATION ESI
AC$CHROMATOGRAPHY: RETENTION_TIME 15.150 min
AC$CHROMATOGRAPHY: COLUMN_NAME 2.1 mm id - 3. 5{mu}m XTerra C18MS
AC$CHROMATOGRAPHY: COLUMN_TEMPERATURE 35 C
AC$CHROMATOGRAPHY: SAMPLING_CONE 15 V, 30 V

MS$DATA_PROCESSING: FIND_PEAK ignore rel.int. < 5

PK$SPLASH: splash10-0bt9-0009000000-5bf52f529edac8331bf6
PK$NUM_PEAK: 8
PK$PEAK: m/z int. rel.int.
  309 999 999
  310 161 161
  311 360 360
  312 51 51
  327 12 12
  347 31 31
  349 16 16
  350 8 8