ACCESSION: MSBNK-Waters-WA000906
RECORD_TITLE: alpha-Hydroxytriazolam; LC-ESI-Q; MS; POS; 90 V
DATE: 2016.01.19 (Created 2007.08.01, modified 2011.05.06)
AUTHORS: Nihon Waters K.K.
LICENSE: CC BY-NC

CH$NAME: alpha-Hydroxytriazolam
CH$COMPOUND_CLASS: N/A
CH$FORMULA: C17H12Cl2N4O
CH$EXACT_MASS: 358.03882
CH$SMILES: OCc(n4)n(c(n4)2)c(c3)c(cc(Cl)c3)C(=NC2)c(c1)c(Cl)ccc1
CH$IUPAC: InChI=1S/C17H12Cl2N4O/c18-10-5-6-14-12(7-10)17(11-3-1-2-4-13(11)19)20-8-15-21-22-16(9-24)23(14)15/h1-7,24H,8-9H2
CH$LINK: CAS 37115-45-0
CH$LINK: INCHIKEY BHUYWUDMVCLHND-UHFFFAOYSA-N
CH$LINK: COMPTOX DTXSID50958284

AC$INSTRUMENT: ZQ, Waters
AC$INSTRUMENT_TYPE: LC-ESI-Q
AC$MASS_SPECTROMETRY: MS_TYPE MS
AC$MASS_SPECTROMETRY: ION_MODE POSITIVE
AC$MASS_SPECTROMETRY: IONIZATION ESI
AC$CHROMATOGRAPHY: RETENTION_TIME 14.800 min
AC$CHROMATOGRAPHY: COLUMN_NAME 2.1 mm id - 3. 5{mu}m XTerra C18MS
AC$CHROMATOGRAPHY: COLUMN_TEMPERATURE 35 C
AC$CHROMATOGRAPHY: SAMPLING_CONE 90 V

MS$DATA_PROCESSING: FIND_PEAK ignore rel.int. < 5

PK$SPLASH: splash10-0kdu-0494000000-4f4bea3f2912e7c6401a
PK$NUM_PEAK: 183
PK$PEAK: m/z int. rel.int.
  125 274 274
  126 20 20
  127 82 82
  128 8 8
  129 24 24
  130 35 35
  136 106 106
  137 196 196
  138 353 353
  139 59 59
  140 525 525
  141 807 807
  142 125 125
  149 321 321
  150 59 59
  151 133 133
  152 47 47
  153 8 8
  154 8 8
  155 24 24
  156 8 8
  157 16 16
  158 8 8
  162 12 12
  163 39 39
  164 20 20
  165 110 110
  166 86 86
  167 27 27
  168 27 27
  169 20 20
  174 82 82
  176 999 999
  177 118 118
  178 368 368
  179 63 63
  180 24 24
  181 106 106
  182 20 20
  187 35 35
  189 20 20
  190 172 172
  191 82 82
  192 27 27
  198 16 16
  199 27 27
  201 149 149
  202 82 82
  203 94 94
  204 180 180
  205 71 71
  206 121 121
  207 20 20
  210 8 8
  212 16 16
  214 184 184
  215 121 121
  216 188 188
  217 114 114
  218 16 16
  219 31 31
  220 16 16
  222 8 8
  223 16 16
  224 27 27
  225 59 59
  226 67 67
  227 31 31
  228 16 16
  229 16 16
  231 94 94
  232 31 31
  233 27 27
  234 12 12
  236 12 12
  237 235 235
  238 200 200
  239 917 917
  240 172 172
  241 270 270
  242 521 521
  243 588 588
  244 82 82
  245 71 71
  246 20 20
  247 20 20
  248 16 16
  250 756 756
  251 298 298
  252 654 654
  253 172 172
  254 149 149
  255 24 24
  258 12 12
  259 8 8
  260 16 16
  261 302 302
  262 27 27
  263 227 227
  264 20 20
  265 55 55
  266 274 274
  267 82 82
  268 118 118
  269 20 20
  270 12 12
  272 180 180
  273 55 55
  274 196 196
  275 67 67
  276 121 121
  277 627 627
  278 564 564
  279 274 274
  280 184 184
  281 20 20
  285 16 16
  286 204 204
  287 110 110
  288 153 153
  289 63 63
  290 31 31
  291 27 27
  293 16 16
  294 16 16
  295 8 8
  296 27 27
  297 35 35
  298 8 8
  299 12 12
  300 8 8
  301 43 43
  302 12 12
  303 24 24
  304 8 8
  305 31 31
  306 98 98
  307 24 24
  308 27 27
  311 8 8
  312 16 16
  313 329 329
  314 71 71
  315 227 227
  316 35 35
  317 35 35
  324 31 31
  325 12 12
  326 8 8
  328 8 8
  329 8 8
  331 776 776
  332 114 114
  333 560 560
  334 71 71
  335 86 86
  336 8 8
  341 86 86
  342 24 24
  343 71 71
  344 8 8
  345 12 12
  359 944 944
  360 129 129
  361 674 674
  362 74 74
  363 110 110
  364 16 16
  377 16 16
  379 12 12
  381 67 67
  382 35 35
  383 51 51
  384 20 20
  385 12 12
  397 153 153
  398 20 20
  399 129 129
  400 16 16
  401 31 31
  402 8 8
  422 35 35
  424 20 20