ACCESSION: MSBNK-Waters-WA001161
RECORD_TITLE: Betamethasone; LC-ESI-Q; MS; POS; 90 V
DATE: 2016.01.19 (Created 2007.08.01, modified 2011.05.06)
AUTHORS: Nihon Waters K.K.
LICENSE: CC BY-NC

CH$NAME: Betamethasone
CH$COMPOUND_CLASS: N/A
CH$FORMULA: C22H29FO5
CH$EXACT_MASS: 392.19990
CH$SMILES: OCC(=O)C(O)(C(C)4)C(C)(C3)C([H])(C4)C([H])(C1)C(F)(C(O)3)C(C)(C=2)C(=CC(=O)C2)C1
CH$IUPAC: InChI=1S/C22H29FO5/c1-12-8-16-15-5-4-13-9-14(25)6-7-19(13,2)21(15,23)17(26)10-20(16,3)22(12,28)18(27)11-24/h6-7,9,12,15-17,24,26,28H,4-5,8,10-11H2,1-3H3/t12-,15-,16-,17-,19-,20-,21-,22-/m0/s1
CH$LINK: CAS 378-44-9
CH$LINK: INCHIKEY UREBDLICKHMUKA-DVTGEIKXSA-N
CH$LINK: COMPTOX DTXSID3022667

AC$INSTRUMENT: ZQ, Waters
AC$INSTRUMENT_TYPE: LC-ESI-Q
AC$MASS_SPECTROMETRY: MS_TYPE MS
AC$MASS_SPECTROMETRY: ION_MODE POSITIVE
AC$MASS_SPECTROMETRY: IONIZATION ESI
AC$CHROMATOGRAPHY: RETENTION_TIME 14.800 min
AC$CHROMATOGRAPHY: COLUMN_NAME 2.1 mm id - 3. 5{mu}m XTerra C18MS
AC$CHROMATOGRAPHY: COLUMN_TEMPERATURE 35 C
AC$CHROMATOGRAPHY: SAMPLING_CONE 90 V

MS$DATA_PROCESSING: FIND_PEAK ignore rel.int. < 5

PK$SPLASH: splash10-05fs-0930000000-2a77d787a8fe1a9adca8
PK$NUM_PEAK: 187
PK$PEAK: m/z int. rel.int.
  103 35 35
  105 435 435
  107 337 337
  109 137 137
  111 43 43
  115 129 129
  116 27 27
  117 215 215
  118 243 243
  119 494 494
  120 16 16
  121 999 999
  122 59 59
  123 67 67
  125 63 63
  128 223 223
  129 125 125
  130 35 35
  131 266 266
  132 157 157
  133 270 270
  135 345 345
  136 59 59
  137 82 82
  139 27 27
  141 67 67
  142 90 90
  143 235 235
  144 149 149
  145 353 353
  146 27 27
  147 748 748
  149 47 47
  150 16 16
  151 55 55
  153 67 67
  154 20 20
  155 74 74
  156 24 24
  157 78 78
  158 63 63
  159 306 306
  160 35 35
  161 161 161
  162 63 63
  163 12 12
  165 55 55
  166 27 27
  167 47 47
  169 74 74
  170 27 27
  171 400 400
  172 102 102
  173 110 110
  175 55 55
  177 67 67
  178 43 43
  179 145 145
  180 35 35
  181 71 71
  182 102 102
  183 94 94
  184 12 12
  185 188 188
  186 31 31
  187 67 67
  188 12 12
  189 20 20
  190 31 31
  191 47 47
  192 51 51
  193 71 71
  194 31 31
  195 168 168
  196 98 98
  197 192 192
  198 43 43
  199 82 82
  201 12 12
  203 24 24
  204 35 35
  205 51 51
  206 43 43
  207 90 90
  208 110 110
  209 200 200
  210 74 74
  211 161 161
  212 59 59
  213 78 78
  214 12 12
  215 74 74
  216 35 35
  218 16 16
  219 74 74
  220 31 31
  221 94 94
  222 161 161
  223 196 196
  224 51 51
  225 90 90
  227 27 27
  228 16 16
  229 12 12
  230 16 16
  231 63 63
  232 27 27
  233 67 67
  234 55 55
  235 110 110
  236 67 67
  237 153 153
  238 31 31
  239 110 110
  240 31 31
  241 27 27
  243 8 8
  244 8 8
  245 27 27
  246 31 31
  247 51 51
  248 86 86
  249 106 106
  250 43 43
  251 27 27
  252 47 47
  253 51 51
  255 8 8
  256 16 16
  259 27 27
  260 16 16
  261 63 63
  262 39 39
  263 231 231
  264 39 39
  265 27 27
  267 27 27
  270 12 12
  272 16 16
  273 8 8
  274 8 8
  275 59 59
  276 16 16
  277 74 74
  278 27 27
  279 129 129
  280 16 16
  281 20 20
  286 16 16
  288 16 16
  289 16 16
  290 12 12
  291 51 51
  295 31 31
  298 8 8
  309 24 24
  311 20 20
  319 39 39
  324 8 8
  325 8 8
  328 8 8
  337 74 74
  342 16 16
  355 59 59
  356 20 20
  360 8 8
  373 59 59
  393 251 251
  394 51 51
  395 16 16
  410 31 31
  411 8 8
  415 106 106
  416 20 20
  431 192 192
  432 39 39
  434 20 20
  435 8 8
  436 8 8
  442 20 20
  443 8 8
  454 8 8
  456 129 129
  457 16 16
  461 8 8
  466 8 8
  472 8 8