ACCESSION: MSBNK-Waters-WA001186
RECORD_TITLE: Amiodarone; LC-ESI-Q; MS; POS; 90 V
DATE: 2016.01.19 (Created 2007.08.01, modified 2011.05.06)
AUTHORS: Nihon Waters K.K.
LICENSE: CC BY-NC

CH$NAME: Amiodarone
CH$COMPOUND_CLASS: N/A
CH$FORMULA: C25H29I2NO3
CH$EXACT_MASS: 645.02368
CH$SMILES: CCCCc(o2)c(c(c3)c(ccc3)2)C(=O)c(c1)cc(I)c(OCCN(CC)CC)c(I)1
CH$IUPAC: InChI=1S/C25H29I2NO3/c1-4-7-11-22-23(18-10-8-9-12-21(18)31-22)24(29)17-15-19(26)25(20(27)16-17)30-14-13-28(5-2)6-3/h8-10,12,15-16H,4-7,11,13-14H2,1-3H3
CH$LINK: CAS 1951-25-3
CH$LINK: INCHIKEY IYIKLHRQXLHMJQ-UHFFFAOYSA-N
CH$LINK: COMPTOX DTXSID7022592

AC$INSTRUMENT: ZQ, Waters
AC$INSTRUMENT_TYPE: LC-ESI-Q
AC$MASS_SPECTROMETRY: MS_TYPE MS
AC$MASS_SPECTROMETRY: ION_MODE POSITIVE
AC$MASS_SPECTROMETRY: IONIZATION ESI
AC$CHROMATOGRAPHY: RETENTION_TIME 18.490 min
AC$CHROMATOGRAPHY: COLUMN_NAME 2.1 mm id - 3. 5{mu}m XTerra C18MS
AC$CHROMATOGRAPHY: COLUMN_TEMPERATURE 35 C
AC$CHROMATOGRAPHY: SAMPLING_CONE 90 V

MS$DATA_PROCESSING: FIND_PEAK ignore rel.int. < 5

PK$SPLASH: splash10-0udi-0951000000-aef6728b1e3d141373f0
PK$NUM_PEAK: 72
PK$PEAK: m/z int. rel.int.
  100 999 999
  101 71 71
  105 12 12
  107 8 8
  115 8 8
  117 16 16
  118 8 8
  121 8 8
  128 8 8
  131 47 47
  133 8 8
  145 12 12
  147 8 8
  157 8 8
  159 114 114
  160 12 12
  171 20 20
  181 8 8
  183 8 8
  184 8 8
  193 8 8
  201 200 200
  202 24 24
  205 12 12
  207 8 8
  219 8 8
  220 12 12
  221 55 55
  222 16 16
  233 16 16
  234 24 24
  235 31 31
  236 8 8
  246 8 8
  247 47 47
  248 27 27
  249 31 31
  250 12 12
  259 8 8
  260 8 8
  261 8 8
  262 8 8
  263 35 35
  264 8 8
  273 20 20
  275 27 27
  276 90 90
  277 47 47
  278 8 8
  290 24 24
  291 12 12
  319 16 16
  347 24 24
  348 20 20
  360 8 8
  361 8 8
  373 31 31
  375 12 12
  376 12 12
  389 8 8
  390 8 8
  391 8 8
  399 12 12
  403 8 8
  417 8 8
  446 8 8
  461 16 16
  476 31 31
  517 43 43
  520 12 12
  646 118 118
  647 24 24