ACCESSION: MSBNK-Waters-WA001190
RECORD_TITLE: Amiodarone; LC-ESI-Q; MS; POS; 30 V
DATE: 2016.01.19 (Created 2007.08.01, modified 2011.05.06)
AUTHORS: Nihon Waters K.K.
LICENSE: CC BY-NC

CH$NAME: Amiodarone
CH$COMPOUND_CLASS: N/A
CH$FORMULA: C25H29I2NO3
CH$EXACT_MASS: 645.02368
CH$SMILES: CCCCc(o2)c(c(c3)c(ccc3)2)C(=O)c(c1)cc(I)c(OCCN(CC)CC)c(I)1
CH$IUPAC: InChI=1S/C25H29I2NO3/c1-4-7-11-22-23(18-10-8-9-12-21(18)31-22)24(29)17-15-19(26)25(20(27)16-17)30-14-13-28(5-2)6-3/h8-10,12,15-16H,4-7,11,13-14H2,1-3H3
CH$LINK: CAS 1951-25-3
CH$LINK: INCHIKEY IYIKLHRQXLHMJQ-UHFFFAOYSA-N
CH$LINK: COMPTOX DTXSID7022592

AC$INSTRUMENT: ZQ, Waters
AC$INSTRUMENT_TYPE: LC-ESI-Q
AC$MASS_SPECTROMETRY: MS_TYPE MS
AC$MASS_SPECTROMETRY: ION_MODE POSITIVE
AC$MASS_SPECTROMETRY: IONIZATION ESI
AC$CHROMATOGRAPHY: RETENTION_TIME 18.490 min
AC$CHROMATOGRAPHY: COLUMN_NAME 2.1 mm id - 3. 5{mu}m XTerra C18MS
AC$CHROMATOGRAPHY: COLUMN_TEMPERATURE 35 C
AC$CHROMATOGRAPHY: SAMPLING_CONE 30 V

MS$DATA_PROCESSING: FIND_PEAK ignore rel.int. < 5

PK$SPLASH: splash10-0002-0010019000-c5c854f412a376a85dae
PK$NUM_PEAK: 16
PK$PEAK: m/z int. rel.int.
  100 35 35
  118 27 27
  242 125 125
  243 20 20
  310 8 8
  394 16 16
  492 39 39
  493 8 8
  518 12 12
  520 176 176
  521 35 35
  550 12 12
  552 16 16
  646 999 999
  647 208 208
  648 24 24