ACCESSION: MSBNK-Waters-WA001207
RECORD_TITLE: Acepromethazine; LC-ESI-Q; MS; POS; 90 V
DATE: 2016.01.19 (Created 2007.08.01, modified 2011.05.06)
AUTHORS: Nihon Waters K.K.
LICENSE: CC BY-NC

CH$NAME: Acepromethazine
CH$COMPOUND_CLASS: N/A
CH$FORMULA: C19H22N2OS
CH$EXACT_MASS: 326.14528
CH$SMILES: CN(C)C(C)CN(c21)c(c3)c(ccc(C(C)=O)3)Sc(cccc2)1
CH$IUPAC: InChI=1S/C19H22N2OS/c1-13(20(3)4)12-21-16-7-5-6-8-18(16)23-19-10-9-15(14(2)22)11-17(19)21/h5-11,13H,12H2,1-4H3
CH$LINK: CAS 13461-01-3
CH$LINK: INCHIKEY XLOQNFNTQIRSOX-UHFFFAOYSA-N

AC$INSTRUMENT: ZQ, Waters
AC$INSTRUMENT_TYPE: LC-ESI-Q
AC$MASS_SPECTROMETRY: MS_TYPE MS
AC$MASS_SPECTROMETRY: ION_MODE POSITIVE
AC$MASS_SPECTROMETRY: IONIZATION ESI
AC$CHROMATOGRAPHY: RETENTION_TIME 14.030 min
AC$CHROMATOGRAPHY: COLUMN_NAME 2.1 mm id - 3. 5{mu}m XTerra C18MS
AC$CHROMATOGRAPHY: COLUMN_TEMPERATURE 35 C
AC$CHROMATOGRAPHY: SAMPLING_CONE 90 V

MS$DATA_PROCESSING: FIND_PEAK ignore rel.int. < 5

PK$SPLASH: splash10-0002-0960000000-f1c5319a6fef9f6357c1
PK$NUM_PEAK: 52
PK$PEAK: m/z int. rel.int.
  105 20 20
  109 8 8
  130 8 8
  146 8 8
  153 47 47
  154 27 27
  162 8 8
  166 8 8
  167 20 20
  170 31 31
  171 27 27
  178 8 8
  179 24 24
  180 24 24
  185 8 8
  191 8 8
  192 8 8
  193 8 8
  196 243 243
  197 999 999
  198 165 165
  199 63 63
  200 12 12
  204 16 16
  205 8 8
  206 31 31
  207 16 16
  208 8 8
  210 8 8
  211 12 12
  212 20 20
  222 55 55
  223 125 125
  224 247 247
  225 67 67
  226 24 24
  228 8 8
  236 8 8
  237 8 8
  238 24 24
  239 16 16
  240 443 443
  241 63 63
  242 24 24
  250 8 8
  252 12 12
  254 8 8
  265 8 8
  266 35 35
  267 8 8
  280 8 8
  281 8 8