ACCESSION: MSBNK-Waters-WA001232
RECORD_TITLE: Oxprenolol; LC-ESI-Q; MS; POS; 30 V
DATE: 2016.01.19 (Created 2007.08.01, modified 2011.05.06)
AUTHORS: Nihon Waters K.K.
LICENSE: CC BY-NC

CH$NAME: Oxprenolol
CH$COMPOUND_CLASS: N/A
CH$FORMULA: C15H23NO3
CH$EXACT_MASS: 265.16779
CH$SMILES: C=CCOc(c1)c(ccc1)OCC(O)CNC(C)C
CH$IUPAC: InChI=1S/C15H23NO3/c1-4-9-18-14-7-5-6-8-15(14)19-11-13(17)10-16-12(2)3/h4-8,12-13,16-17H,1,9-11H2,2-3H3
CH$LINK: CAS 6452-71-7
CH$LINK: INCHIKEY CEMAWMOMDPGJMB-UHFFFAOYSA-N
CH$LINK: COMPTOX DTXSID1043835

AC$INSTRUMENT: ZQ, Waters
AC$INSTRUMENT_TYPE: LC-ESI-Q
AC$MASS_SPECTROMETRY: MS_TYPE MS
AC$MASS_SPECTROMETRY: ION_MODE POSITIVE
AC$MASS_SPECTROMETRY: IONIZATION ESI
AC$CHROMATOGRAPHY: RETENTION_TIME 10.000 min
AC$CHROMATOGRAPHY: COLUMN_NAME 2.1 mm id - 3. 5{mu}m XTerra C18MS
AC$CHROMATOGRAPHY: COLUMN_TEMPERATURE 35 C
AC$CHROMATOGRAPHY: SAMPLING_CONE 30 V

MS$DATA_PROCESSING: FIND_PEAK ignore rel.int. < 5

PK$SPLASH: splash10-014i-0090000000-146b5f50fbb5ffb2a2c8
PK$NUM_PEAK: 11
PK$PEAK: m/z int. rel.int.
  116 118 118
  184 8 8
  189 8 8
  206 8 8
  225 172 172
  226 24 24
  248 24 24
  266 999 999
  267 153 153
  268 16 16
  288 8 8