ACCESSION: MSBNK-Waters-WA001489
RECORD_TITLE: Floctafenic acid; LC-ESI-Q; MS; POS; 60 V
DATE: 2016.01.19 (Created 2007.08.01, modified 2011.05.06)
AUTHORS: Nihon Waters K.K.
LICENSE: CC BY-NC

CH$NAME: Floctafenic acid
CH$COMPOUND_CLASS: N/A
CH$FORMULA: C17H11F3N2O2
CH$EXACT_MASS: 332.07726
CH$SMILES: OC(=O)c(c3)c(ccc3)Nc(c2)c(c1)c(nc2)c(cc1)C(F)(F)F
CH$IUPAC: InChI=1S/C17H11F3N2O2/c18-17(19,20)12-6-3-5-10-14(8-9-21-15(10)12)22-13-7-2-1-4-11(13)16(23)24/h1-9H,(H,21,22)(H,23,24)
CH$LINK: CAS 36783-34-3
CH$LINK: INCHIKEY RGUIKQRAZCQMBM-UHFFFAOYSA-N
CH$LINK: COMPTOX DTXSID60190254

AC$INSTRUMENT: ZQ, Waters
AC$INSTRUMENT_TYPE: LC-ESI-Q
AC$MASS_SPECTROMETRY: MS_TYPE MS
AC$MASS_SPECTROMETRY: ION_MODE POSITIVE
AC$MASS_SPECTROMETRY: IONIZATION ESI
AC$CHROMATOGRAPHY: RETENTION_TIME 14.780 min
AC$CHROMATOGRAPHY: COLUMN_NAME 2.1 mm id - 3. 5{mu}m XTerra C18MS
AC$CHROMATOGRAPHY: COLUMN_TEMPERATURE 35 C
AC$CHROMATOGRAPHY: SAMPLING_CONE 60 V

MS$DATA_PROCESSING: FIND_PEAK ignore rel.int. < 5

PK$SPLASH: splash10-0002-0092000000-b47046931ea87abe0e62
PK$NUM_PEAK: 13
PK$PEAK: m/z int. rel.int.
  267 67 67
  268 12 12
  269 8 8
  275 8 8
  295 999 999
  296 204 204
  297 20 20
  313 39 39
  314 8 8
  315 204 204
  316 39 39
  333 20 20
  336 27 27