ACCESSION: MSBNK-Waters-WA001493
RECORD_TITLE: Floctafenic acid; LC-ESI-Q; MS; NEG; 30 V
DATE: 2016.01.19 (Created 2007.08.01, modified 2011.05.06)
AUTHORS: Nihon Waters K.K.
LICENSE: CC BY-NC

CH$NAME: Floctafenic acid
CH$COMPOUND_CLASS: N/A
CH$FORMULA: C17H11F3N2O2
CH$EXACT_MASS: 332.07726
CH$SMILES: OC(=O)c(c3)c(ccc3)Nc(c2)c(c1)c(nc2)c(cc1)C(F)(F)F
CH$IUPAC: InChI=1S/C17H11F3N2O2/c18-17(19,20)12-6-3-5-10-14(8-9-21-15(10)12)22-13-7-2-1-4-11(13)16(23)24/h1-9H,(H,21,22)(H,23,24)
CH$LINK: CAS 36783-34-3
CH$LINK: INCHIKEY RGUIKQRAZCQMBM-UHFFFAOYSA-N
CH$LINK: COMPTOX DTXSID60190254

AC$INSTRUMENT: ZQ, Waters
AC$INSTRUMENT_TYPE: LC-ESI-Q
AC$MASS_SPECTROMETRY: MS_TYPE MS
AC$MASS_SPECTROMETRY: ION_MODE NEGATIVE
AC$MASS_SPECTROMETRY: IONIZATION ESI
AC$CHROMATOGRAPHY: RETENTION_TIME 14.780 min
AC$CHROMATOGRAPHY: COLUMN_NAME 2.1 mm id - 3. 5{mu}m XTerra C18MS
AC$CHROMATOGRAPHY: COLUMN_TEMPERATURE 35 C
AC$CHROMATOGRAPHY: SAMPLING_CONE 30 V

MS$DATA_PROCESSING: FIND_PEAK ignore rel.int. < 5

PK$SPLASH: splash10-001i-0009000000-234046ec98f4bedbaab1
PK$NUM_PEAK: 5
PK$PEAK: m/z int. rel.int.
  267 12 12
  287 35 35
  331 999 999
  332 188 188
  333 24 24