ACCESSION: MSBNK-Waters-WA001563
RECORD_TITLE: Femcamfamine; LC-ESI-Q; MS; POS; 60 V
DATE: 2016.01.19 (Created 2007.08.01, modified 2011.05.06)
AUTHORS: Nihon Waters K.K.
LICENSE: CC BY-NC

CH$NAME: Femcamfamine
CH$COMPOUND_CLASS: N/A
CH$FORMULA: C15H21N
CH$EXACT_MASS: 215.16740
CH$SMILES: CCNC(C21)C(c(c3)cccc3)C(CC2)C1
CH$IUPAC: InChI=1S/C15H21N/c1-2-16-15-13-9-8-12(10-13)14(15)11-6-4-3-5-7-11/h3-7,12-16H,2,8-10H2,1H3
CH$LINK: CAS 1209-98-9
CH$LINK: INCHIKEY IKFBPFGUINLYQI-UHFFFAOYSA-N

AC$INSTRUMENT: ZQ, Waters
AC$INSTRUMENT_TYPE: LC-ESI-Q
AC$MASS_SPECTROMETRY: MS_TYPE MS
AC$MASS_SPECTROMETRY: ION_MODE POSITIVE
AC$MASS_SPECTROMETRY: IONIZATION ESI
AC$CHROMATOGRAPHY: RETENTION_TIME 12.880 min
AC$CHROMATOGRAPHY: COLUMN_NAME 2.1 mm id - 3. 5{mu}m XTerra C18MS
AC$CHROMATOGRAPHY: COLUMN_TEMPERATURE 35 C
AC$CHROMATOGRAPHY: SAMPLING_CONE 60 V

MS$DATA_PROCESSING: FIND_PEAK ignore rel.int. < 5

PK$SPLASH: splash10-00or-0910000000-105ed885faf677ad082c
PK$NUM_PEAK: 20
PK$PEAK: m/z int. rel.int.
  103 12 12
  105 247 247
  106 24 24
  108 8 8
  115 102 102
  117 223 223
  118 35 35
  127 8 8
  128 82 82
  129 999 999
  130 94 94
  132 8 8
  141 12 12
  143 184 184
  144 24 24
  156 8 8
  171 106 106
  172 12 12
  216 317 317
  217 39 39