ACCESSION: MSBNK-Waters-WA001748
RECORD_TITLE: Albendazole sulfone; LC-ESI-Q; MS; POS; 15 V
DATE: 2016.01.19 (Created 2007.08.01, modified 2011.09.27)
AUTHORS: Nihon Waters K.K.
LICENSE: CC BY-NC

CH$NAME: Albendazole sulfone
CH$COMPOUND_CLASS: N/A
CH$FORMULA: C12H15N3O4S
CH$EXACT_MASS: 297.07833
CH$SMILES: CCCS(=O)(=O)C1=CC2=C(C=C1)N=C(N2)NC(=O)OC
CH$IUPAC: InChI=1S/C12H15N3O4S/c1-3-6-20(17,18)8-4-5-9-10(7-8)14-11(13-9)15-12(16)19-2/h4-5,7H,3,6H2,1-2H3,(H2,13,14,15,16)
CH$LINK: CAS 75184-71-3
CH$LINK: INCHIKEY CLSJYOLYMZNKJB-UHFFFAOYSA-N
CH$LINK: COMPTOX DTXSID00226167

AC$INSTRUMENT: ZQ, Waters
AC$INSTRUMENT_TYPE: LC-ESI-Q
AC$MASS_SPECTROMETRY: MS_TYPE MS
AC$MASS_SPECTROMETRY: ION_MODE POSITIVE
AC$MASS_SPECTROMETRY: IONIZATION ESI
AC$CHROMATOGRAPHY: RETENTION_TIME 13.180 min
AC$CHROMATOGRAPHY: COLUMN_NAME 2.1 mm id - 3. 5{mu}m XTerra C18MS
AC$CHROMATOGRAPHY: COLUMN_TEMPERATURE 35 C
AC$CHROMATOGRAPHY: SAMPLING_CONE 15 V

MS$DATA_PROCESSING: FIND_PEAK ignore rel.int. < 5

PK$SPLASH: splash10-0002-0195000000-64c523e08cd094e6b4c4
PK$ANNOTATION: m/z type
  226 [M+H]+
  336 [M+K]+
PK$NUM_PEAK: 20
PK$PEAK: m/z int. rel.int.
  122 8 8
  123 16 16
  125 8 8
  144 8 8
  192 180 180
  193 8 8
  215 8 8
  264 8 8
  272 8 8
  291 12 12
  298 999 999
  299 133 133
  300 67 67
  301 12 12
  307 8 8
  314 8 8
  336 423 423
  337 71 71
  338 71 71
  339 20 20