ACCESSION: MSBNK-Waters-WA002279
RECORD_TITLE: Alimemazine (oxide); LC-ESI-Q; MS; POS; 30 V
DATE: 2016.01.19 (Created 2007.05.08, modified 2011.09.27)
AUTHORS: Nihon Waters K.K.
LICENSE: CC BY-NC

CH$NAME: Alimemazine (oxide)
CH$NAME: sulfoxide
CH$COMPOUND_CLASS: N/A
CH$FORMULA: C18H22N2OS
CH$EXACT_MASS: 314.14528
CH$SMILES: CN(C)CC(C)CN(c21)c(c3)c(ccc3)S(=O)c(cccc2)1
CH$IUPAC: InChI=1S/C18H22N2OS/c1-14(12-19(2)3)13-20-15-8-4-6-10-17(15)22(21)18-11-7-5-9-16(18)20/h4-11,14H,12-13H2,1-3H3
CH$LINK: CAS 84-96-8
CH$LINK: INCHIKEY XZLXDYORQZVLKR-UHFFFAOYSA-N
CH$LINK: COMPTOX DTXSID40905702

AC$INSTRUMENT: ZQ, Waters
AC$INSTRUMENT_TYPE: LC-ESI-Q
AC$MASS_SPECTROMETRY: MS_TYPE MS
AC$MASS_SPECTROMETRY: ION_MODE POSITIVE
AC$MASS_SPECTROMETRY: IONIZATION ESI
AC$CHROMATOGRAPHY: RETENTION_TIME 14.740 min
AC$CHROMATOGRAPHY: COLUMN_NAME 2.1 mm id - 3. 5{mu}m XTerra C18MS
AC$CHROMATOGRAPHY: COLUMN_TEMPERATURE 35 C
AC$CHROMATOGRAPHY: SAMPLING_CONE 30 V

MS$DATA_PROCESSING: FIND_PEAK ignore rel.int. < 5

PK$SPLASH: splash10-0002-0296000000-a669d144a02315422560
PK$ANNOTATION: m/z type
  315 [M+H]+
  331 [M+O+H]+
PK$NUM_PEAK: 14
PK$PEAK: m/z int. rel.int.
  100 235 235
  101 16 16
  212 16 16
  254 8 8
  270 8 8
  299 999 999
  300 188 188
  301 59 59
  302 8 8
  315 82 82
  316 16 16
  331 321 321
  332 59 59
  333 20 20