ACCESSION: MSBNK-Waters-WA002287
RECORD_TITLE: Erythromycin; LC-ESI-Q; MS; NEG; 30 V
DATE: 2016.01.19 (Created 2007.08.01, modified 2011.05.06)
AUTHORS: Nihon Waters K.K.
LICENSE: CC BY-NC

CH$NAME: Erythromycin
CH$COMPOUND_CLASS: N/A
CH$FORMULA: C37H67NO13
CH$EXACT_MASS: 733.46124
CH$SMILES: CC[C@@H]1[C@@]([C@@H]([C@H](C(=O)[C@@H](C[C@@]([C@@H]([C@H]([C@@H]([C@H](C(=O)O1)C)O[C@H]2C[C@@]([C@H]([C@@H](O2)C)O)(C)OC)C)O[C@H]3[C@@H]([C@H](C[C@H](O3)C)N(C)C)O)(C)O)C)C)O)(C)O
CH$IUPAC: InChI=1S/C37H67NO13/c1-14-25-37(10,45)30(41)20(4)27(39)18(2)16-35(8,44)32(51-34-28(40)24(38(11)12)15-19(3)47-34)21(5)29(22(6)33(43)49-25)50-26-17-36(9,46-13)31(42)23(7)48-26/h18-26,28-32,34,40-42,44-45H,14-17H2,1-13H3/t18-,19-,20+,21+,22-,23+,24+,25-,26+,28-,29+,30-,31+,32-,34+,35-,36-,37-/m1/s1
CH$LINK: CAS 114-07-8
CH$LINK: INCHIKEY ULGZDMOVFRHVEP-RWJQBGPGSA-N
CH$LINK: COMPTOX DTXSID4022991

AC$INSTRUMENT: ZQ, Waters
AC$INSTRUMENT_TYPE: LC-ESI-Q
AC$MASS_SPECTROMETRY: MS_TYPE MS
AC$MASS_SPECTROMETRY: ION_MODE NEGATIVE
AC$MASS_SPECTROMETRY: IONIZATION ESI
AC$CHROMATOGRAPHY: RETENTION_TIME 13.500 min
AC$CHROMATOGRAPHY: COLUMN_NAME 2.1 mm id - 3. 5{mu}m XTerra C18MS
AC$CHROMATOGRAPHY: COLUMN_TEMPERATURE 35 C
AC$CHROMATOGRAPHY: SAMPLING_CONE 30 V

MS$DATA_PROCESSING: FIND_PEAK ignore rel.int. < 5

PK$SPLASH: splash10-004j-0301430900-0f977ba78f2f436af240
PK$NUM_PEAK: 66
PK$PEAK: m/z int. rel.int.
  103 27 27
  105 8 8
  113 364 364
  114 8 8
  119 8 8
  129 78 78
  143 8 8
  147 24 24
  157 8 8
  159 16 16
  165 39 39
  171 8 8
  174 86 86
  175 31 31
  181 24 24
  197 16 16
  227 12 12
  243 8 8
  249 39 39
  251 8 8
  323 114 114
  324 31 31
  348 8 8
  381 74 74
  382 16 16
  424 55 55
  425 16 16
  442 16 16
  470 12 12
  471 16 16
  484 12 12
  498 756 756
  499 219 219
  500 35 35
  501 8 8
  538 31 31
  539 12 12
  542 20 20
  543 8 8
  556 435 435
  557 149 149
  558 24 24
  732 24 24
  733 16 16
  756 8 8
  762 8 8
  764 12 12
  765 12 12
  768 137 137
  769 63 63
  770 59 59
  772 24 24
  774 8 8
  778 999 999
  779 458 458
  780 157 157
  781 27 27
  782 8 8
  792 12 12
  809 12 12
  823 12 12
  830 31 31
  831 20 20
  832 12 12
  846 8 8
  863 8 8