ACCESSION: MSBNK-Waters-WA002312
RECORD_TITLE: Carbidopa; LC-ESI-Q; MS; NEG; 15 V
DATE: 2016.01.19 (Created 2007.08.01, modified 2011.05.06)
AUTHORS: Nihon Waters K.K.
LICENSE: CC BY-NC

CH$NAME: Carbidopa
CH$COMPOUND_CLASS: N/A
CH$FORMULA: C10H14N2O4
CH$EXACT_MASS: 226.09536
CH$SMILES: NNC(C)(C(O)=O)Cc(c1)cc(O)c(O)c1
CH$IUPAC: InChI=1S/C10H14N2O4/c1-10(12-11,9(15)16)5-6-2-3-7(13)8(14)4-6/h2-4,12-14H,5,11H2,1H3,(H,15,16)/t10-/m0/s1
CH$LINK: CAS 28860-95-9
CH$LINK: INCHIKEY TZFNLOMSOLWIDK-JTQLQIEISA-N
CH$LINK: COMPTOX DTXSID4022735

AC$INSTRUMENT: ZQ, Waters
AC$INSTRUMENT_TYPE: LC-ESI-Q
AC$MASS_SPECTROMETRY: MS_TYPE MS
AC$MASS_SPECTROMETRY: ION_MODE NEGATIVE
AC$MASS_SPECTROMETRY: IONIZATION ESI
AC$CHROMATOGRAPHY: RETENTION_TIME 3.120 min
AC$CHROMATOGRAPHY: COLUMN_NAME 2.1 mm id - 3. 5{mu}m XTerra C18MS
AC$CHROMATOGRAPHY: COLUMN_TEMPERATURE 35 C
AC$CHROMATOGRAPHY: SAMPLING_CONE 15 V

MS$DATA_PROCESSING: FIND_PEAK ignore rel.int. < 5

PK$SPLASH: splash10-004i-0090000000-a4d8781e568cfe31ec6b
PK$NUM_PEAK: 20
PK$PEAK: m/z int. rel.int.
  104 8 8
  107 8 8
  117 8 8
  127 8 8
  129 8 8
  130 8 8
  158 8 8
  225 999 999
  226 133 133
  232 8 8
  237 27 27
  238 8 8
  249 8 8
  257 16 16
  261 8 8
  271 274 274
  272 27 27
  288 8 8
  293 27 27
  294 8 8