ACCESSION: MSBNK-Waters-WA002939
RECORD_TITLE: Ethylmorphine; LC-ESI-Q; MS; POS; 15 V
DATE: 2016.01.19 (Created 2007.08.01, modified 2011.05.06)
AUTHORS: Nihon Waters K.K.
LICENSE: CC BY-NC

CH$NAME: Ethylmorphine
CH$COMPOUND_CLASS: N/A
CH$FORMULA: C19H23NO3
CH$EXACT_MASS: 313.16779
CH$SMILES: CCOc(c5)c(O4)c(c(c5)1)C(C2)(C34)C([H])(C=CC(O)3)C(N(C)C2)C1
CH$IUPAC: InChI=1S/C19H23NO3/c1-3-22-15-7-4-11-10-13-12-5-6-14(21)18-19(12,8-9-20(13)2)16(11)17(15)23-18/h4-7,12-14,18,21H,3,8-10H2,1-2H3/t12-,13+,14-,18-,19-/m0/s1
CH$LINK: CAS 76-58-4
CH$LINK: INCHIKEY OGDVEMNWJVYAJL-LEPYJNQMSA-N
CH$LINK: COMPTOX DTXSID1046760

AC$INSTRUMENT: ZQ, Waters
AC$INSTRUMENT_TYPE: LC-ESI-Q
AC$MASS_SPECTROMETRY: MS_TYPE MS
AC$MASS_SPECTROMETRY: ION_MODE POSITIVE
AC$MASS_SPECTROMETRY: IONIZATION ESI
AC$CHROMATOGRAPHY: RETENTION_TIME 10.940 min
AC$CHROMATOGRAPHY: COLUMN_NAME 2.1 mm id - 3. 5{mu}m XTerra C18MS
AC$CHROMATOGRAPHY: COLUMN_TEMPERATURE 35 C
AC$CHROMATOGRAPHY: SAMPLING_CONE 15 V

MS$DATA_PROCESSING: FIND_PEAK ignore rel.int. < 5

PK$SPLASH: splash10-03di-0029000000-93fcd362869171e9e64a
PK$NUM_PEAK: 39
PK$PEAK: m/z int. rel.int.
  145 6 6
  165 6 6
  173 10 10
  175 12 12
  181 10 10
  183 14 14
  185 5 5
  189 7 7
  191 5 5
  193 7 7
  194 5 5
  199 6 6
  200 8 8
  201 18 18
  202 6 6
  209 7 7
  211 12 12
  213 18 18
  219 6 6
  221 7 7
  227 8 8
  229 42 42
  230 7 7
  236 6 6
  237 7 7
  239 21 21
  240 6 6
  255 10 10
  257 25 25
  258 5 5
  266 6 6
  267 9 9
  268 7 7
  296 20 20
  297 8 8
  312 12 12
  314 999 999
  315 172 172
  316 16 16