ACCESSION: MSBNK-Waters-WA002991
RECORD_TITLE: Cefuroxime; LC-ESI-Q; MS; NEG; 15 V
DATE: 2016.01.19 (Created 2007.08.01, modified 2011.05.06)
AUTHORS: Nihon Waters K.K.
LICENSE: CC BY-NC

CH$NAME: Cefuroxime
CH$COMPOUND_CLASS: N/A
CH$FORMULA: C16H16N4O8S
CH$EXACT_MASS: 424.06888
CH$SMILES: CO/N=C(/C1=CC=CO1)\C(=O)N[C@H]2[C@@H]3N(C2=O)C(=C(CS3)COC(=O)N)C(=O)O
CH$IUPAC: InChI=1S/C16H16N4O8S/c1-26-19-9(8-3-2-4-27-8)12(21)18-10-13(22)20-11(15(23)24)7(5-28-16(17)25)6-29-14(10)20/h2-4,10,14H,5-6H2,1H3,(H2,17,25)(H,18,21)(H,23,24)/b19-9-/t10-,14-/m1/s1
CH$LINK: CAS 55268-75-2
CH$LINK: INCHIKEY JFPVXVDWJQMJEE-IZRZKJBUSA-N
CH$LINK: PUBCHEM CID:5479529

AC$INSTRUMENT: ZQ, Waters
AC$INSTRUMENT_TYPE: LC-ESI-Q
AC$MASS_SPECTROMETRY: MS_TYPE MS
AC$MASS_SPECTROMETRY: ION_MODE NEGATIVE
AC$MASS_SPECTROMETRY: IONIZATION ESI
AC$CHROMATOGRAPHY: RETENTION_TIME 11.420 min
AC$CHROMATOGRAPHY: COLUMN_NAME 2.1 mm id - 3. 5{mu}m XTerra C18MS
AC$CHROMATOGRAPHY: COLUMN_TEMPERATURE 35 C
AC$CHROMATOGRAPHY: SAMPLING_CONE 15 V

MS$DATA_PROCESSING: FIND_PEAK ignore rel.int. < 5

PK$SPLASH: splash10-00di-0001900000-4bb6ba38d88aaa4855fd
PK$NUM_PEAK: 15
PK$PEAK: m/z int. rel.int.
  168 12 12
  207 43 43
  208 12 12
  215 12 12
  318 86 86
  319 12 12
  320 8 8
  336 16 16
  362 63 63
  363 12 12
  412 20 20
  423 999 999
  424 176 176
  425 86 86
  426 16 16